{"text_format":"1","workbook":"xlsx","n_sheets":18,"sheets":["Guide","Main","species","Impact","Summary","Vegetation Removal Request","Native Veg List","Native Veg Summary","GIS Dump","BlankVegRemovalRequest","BlankNative Veg List","BlankImpact","BlankSummary","BlankNative Veg Summary","Macro","Validation Lists","Signatures","Data Sheet History"],"not_rendered":{"charts":0,"images":0,"macros":1,"external_links":1,"defined_names":38,"comments":9,"pivot_tables":0},"unopened":[],"bounds":{"document_bytes":16777216,"sheet_cells":100000,"rows_first":2000,"rows_last":500,"rows_between":2000,"halvings":0,"cell_chars":16384,"cell_head_chars":4096},"cells_cut":0,"cells_raw":0,"read":"whole","date_system":"1900"}

{"sheet":"Guide","index":0,"n_rows":31,"n_cols":14,"rows_kept":31,"cut":false,"hidden":false,"merged":[[0,13,0,19],[22,4,23,10],[25,4,26,10],[30,4,31,10],[0,0,0,10],[1,1,1,10],[3,4,4,10],[6,4,7,10],[11,4,12,10],[14,4,15,10],[17,4,18,10]]}
["GUIDE & LINKS TO THE VARIOUS SPREAD SHEETS INCLUDED IN THIS VEGETATION SURVEY DOCUMENT",null,null,null,null,null,null,null,null,null,null,null,null,"Superseded/repealed from 1 November 2021 – refer to \nhttps://www.dit.sa.gov.au/standards/environment"]
[null,"Use the buttons below to take you directly to the spread sheet you require. Note if the spread sheets are blank, then the Vegetation Survey Data Sheet (\"Main\" tab) may not have been \"run\".  Go to the Vegetation Survey Data Sheet and activated the \"Create Impacts Table\" button (top left corner). If the spread sheets are still blank then the impact information on the Vegetation Survey Data Sheet has not been completed."]
[null,null,null,null,"Vegetation Survey"]
[null,null,null,null,"Data sheet containing all information collected during the field inspection and includes impacts and approvals. Most of the automated inputs into the rest of the spread sheets listed below originate from this sheet.  Significant manual input is required. (Tab or Sheet name \"Main\")"]
[]
[]
[null,null,null,null,"Used for native vegetation, subject to the Native Vegetation Act, tree formula input.  Automatically inserts into the data sheet above selected species with species specific height formulas.  No manual input is required. (Tab or Sheet name \"Species\")."]
[]
[]
[]
[null,null,null,null,"All Impacts & Removal Approvals"]
[null,null,null,null,"Automatically created Table individually listing all impacts including native vegetation, DAC trees, amenity planting and weeds.  Also shows Offset amounts and trees recommended for Monitoring.  Minimal manual input is required. (Tab or Sheet  \"Impact\")"]
[]
[]
[null,null,null,null,"Automatically created Summary of all impacts including native vegetation, DAC trees, amenity planting and weeds.  Also shows Approval Levels, Offset amounts, Payment Options, NRM Boards, TSD Regions & Monitoring numbers. Minimal manual input is required. (Tab or Sheet  name \"Summary\")"]
[]
[]
[null,null,null,null,"Automatically created Vegetation Removal Form with some manual input required. (Tab or Sheet  name \"Vegetation Removal Request\")"]
[]
[]
[]
[null,null,null,null,"Native Vegetation Documentation"]
[null,null,null,null,"Automatically created Impacts Table individually listing native vegetation subject to the Native Vegetation Act only. Minimal manual input is required. (Tab or Sheet  name \"Native Veg List\")"]
[]
[]
[null,null,null,null,"Automatically created Summary of native vegetation subject to the Native Vegetation Act only. Minimal manual input is required. (Tab or Sheet  name \"Native Veg Summary\")"]
[]
[]
[]
[null,null,null,null,"Miscellaneous"]
[null,null,null,null,"If required a format free dump of the entire vegetation survey (information from the Vegetation Survey Data Sheet) which makes for an easier data transfer into GIS.(Tab or Sheet  name \"GIS Dump\")"]

{"sheet":"Main","index":1,"n_rows":52,"n_cols":110,"rows_kept":52,"cut":false,"hidden":false,"merged":[[20,101,20,102],[21,101,21,102],[22,101,22,102],[23,101,23,102],[25,101,25,102],[26,101,26,102],[27,101,27,102],[17,101,17,102],[18,101,18,102],[19,101,19,102],[24,101,24,102],[16,101,16,102],[10,102,11,102],[8,102,9,102],[8,101,9,101],[12,101,13,102],[3,101,4,102],[7,100,8,100],[5,102,7,102],[5,101,7,101],[3,100,6,100],[3,98,14,98],[3,84,14,84],[3,85,14,85],[1,86,14,86],[1,87,14,87],[1,109,14,109],[14,101,14,102],[1,101,2,102],[9,100,14,100],[2,92,14,92],[1,90,1,92],[2,91,14,91],[10,101,11,101],[12,88,13,88],[1,88,11,88],[1,89,14,89],[3,93,14,93],[3,94,14,94],[3,95,14,95],[3,96,14,96],[3,97,14,97],[2,90,14,90],[3,99,14,99],[4,60,5,60],[6,60,14,60],[1,62,14,62],[1,52,14,52],[6,58,14,58],[6,56,14,56],[2,94,2,95],[2,96,2,97],[6,69,14,69],[1,69,5,69],[3,70,14,70],[3,71,14,71],[3,72,14,72],[1,70,2,72],[1,93,1,100],[3,78,14,78],[3,83,14,83],[3,81,14,81],[3,77,14,77],[3,80,14,80],[2,73,14,73],[2,75,14,75],[3,79,14,79],[2,98,2,100],[3,82,14,82],[1,46,14,46],[1,47,14,47],[1,49,14,49],[1,50,14,50],[3,76,14,76],[2,74,14,74],[2,55,5,55],[1,45,14,45],[1,48,14,48],[1,67,14,67],[2,56,5,56],[1,65,14,65],[1,64,14,64],[1,63,14,63],[1,51,14,51],[1,60,3,60],[2,59,14,59],[6,55,14,55],[1,61,14,61],[2,57,5,57],[6,57,14,57],[1,66,14,66],[1,68,14,68],[2,58,5,58],[1,53,14,53],[2,54,14,54],[8,0,14,0],[8,1,14,1],[8,2,14,2],[10,12,14,12],[10,13,14,13],[10,14,14,14],[10,15,14,15],[7,20,14,20],[1,20,2,20],[10,4,11,4],[8,4,9,4],[12,4,13,4],[3,4,4,4],[2,6,14,6],[2,7,14,7],[1,19,2,19],[3,17,14,17],[3,19,14,19],[4,20,5,20],[2,8,14,8],[2,9,14,9],[2,11,14,11],[1,6,1,11],[1,16,2,16],[1,33,14,33],[1,37,14,37],[1,24,2,26],[1,34,14,34],[3,24,4,24],[6,26,14,26],[9,24,14,24],[1,27,14,27],[1,29,14,29],[2,10,15,10],[8,23,14,23],[5,23,7,23],[1,23,4,23],[1,12,9,15],[3,16,14,16],[1,17,2,17],[1,21,14,21],[6,25,7,25],[3,18,14,18],[1,18,2,18],[6,24,7,24],[1,22,14,22],[1,44,14,44],[1,30,14,30],[1,31,14,31],[1,32,14,32],[1,43,14,43],[1,39,14,39],[9,25,14,25],[3,25,4,25],[3,26,4,26],[1,28,14,28],[1,36,14,36],[1,35,14,35],[1,40,14,40],[1,38,14,38],[1,41,14,41],[1,42,14,42],[50,101,50,102],[51,101,51,102],[28,101,28,102],[29,101,29,102],[30,101,30,102],[31,101,31,102],[48,101,48,102],[47,101,47,102],[46,101,46,102],[45,101,45,102],[44,101,44,102],[43,101,43,102],[42,101,42,102],[41,101,41,102],[40,101,40,102],[39,101,39,102],[38,101,38,102],[37,101,37,102],[36,101,36,102],[35,101,35,102],[34,101,34,102],[33,101,33,102],[32,101,32,102]]}
[]
["DEPARTMENT OF PLANNING, TRANSPORT &  INFRASTRUCTURE",null,null,null,null,"Project Name: ","SAFETY",null,null,null,null,null,"IMPACT OR RECOMMENDED ACTION",null,null,null,"Y\nN","Y\nN","Y\nN","Y\nN","TOTAL NVA AREA (HA)","AREA TO BE REMOVED SUBJECT TO THE NVA (m2)","NVA SEB Multiplication Factor (Condition)",{"$f":"SUM($X$17:$X$3789)","v":0},"TOTAL NUMBER OF INDIVIDUALS SURVEYED ",null,null,"NVA - STANDARD CLEARANCE\nREMOVAL \nNumber of Native Veg","NVA - STANDARD CLEARANCE\nMAJOR PRUNE\nNumber of Native Veg","NVA - Area of Native Veg (ha) - SEB","NVA - Regulation 5(1)(lb)\nREMOVAL \nNumber of Native Veg","NVA - Regulation 5(1)(lb)\nMAJOR PRUNE\nNumber of Native Veg","NVA - Regulation 5(1)(lb)\nArea of Native Veg","NVA - STRUCTURALLY UNSOUND OR WITHIN THE CLEARANCE ENVELOPE\nREMOVAL \nNumber of Native Veg","NVA - STRUCTURALLY UNSOUND OR WITHIN THE CLEARANCE ENVELOPE\nMAJOR PRUNE\nNumber of Native Veg","Weeds/Other - REMOVAL\nNumber of weeds and \"others\" excluding amenity planting","Weeds/Other - MAJOR PRUNE\nNumber of weeds and \"others\" excluding amenity planting","Weeds/Other - AREA OF WEEDS EXCLUDING AMENITY","REMOVAL\nNumber - Native Vegetation Not covered by ACT","MAJOR PRUNE\nNumber - Native Vegetation Not covered by ACT","Area (m2) - Native Vegetation Not covered by ACT","Structurally unsound/within the Clearance Envelope/DEAD\nREMOVAL \nNumber - Native Vegetation Not covered by ACT","Structurally unsound/within the Clearance Envelope/DEAD\nMAJOR PRUNE\nNumber - Native Vegetation Not covered by ACT","Amenity - REMOVAL\nNumber - Amenity Planting","Amenity - MAJOR PRUNE\nNumber - Amenity Planting","Amenity - Area (m2) - Amenity Planting","Amenity - STRUCTURALLY UNSOUND ETC AND/OR DEAD\nREMOVAL \nNumber - Amenity Planting","Amenity - STRUCTURALLY UNSOUND\nMAJOR PRUNE\nNumber - Amenity Planting","REMOVAL\nNumber - Regulated Significant Trees","OFFSET\nNumber - Regulated Significant Trees","MAJOR PRUNE\nNumber - Regulated Significant Trees","REMOVAL\nNumber - Regulated Trees","OFFSET\nNumber - Regulated Trees","MAJOR PRUNE\nNumber - Regulated Trees","A","B","C","D","E","F",{"$f":"SUM(BI17:BI3833)","v":0},"SINGLE-STEMMED(S) OR  MULTI-STEMMED(M) SPECIMEN","BUTT DIA (M). IN GROUP AND/OR MS SITUATIONS INSERT HIGHEST RANGE READING","BUTT DIA (M). ONLY USE THIS COLUMN IN A GROUP AND/OR MS SITUATION INSERT LOWEST  RANGE","CIRCUMFERENCE (M) DEVELOPMENT ACT REQUIREMENT ONLY","HEIGHT (m) - In GROUP situations insert HIGHEST range reading.","HEIGHT (m) - In GROUP situations insert LOWEST range reading.","SPREAD (m) - In GROUP situations insert WIDEST range reading.","SPREAD (m) - In GROUP situations insert NARROWEST range reading.","E\nG\nF\nP\nD","Calculator",null,null,"NVA INFORMATION",null,null,null,null,null,null,null,null,null,null,null,null,"TOTAL SCORE","RECOMMENDATION","A 'FALSE' reading indicates Refusal under normal circumstances.","SEB Offset Area Requirement (total removal scattered trees)","APPROVALS",null,null,"SET ASIDE",null,null,null,null,null,null,null,"PAYMENT INTO THE FUND FOR SCATTERED TREES",null,null,null,null,null,null,null,"Comments"]
["SAFETY & SERVICE DIVISION            Revision - August 2018",null,null,null,null,"Road Number : ","CLEARANCE ENVELOPE (S - Standard, R - Restricted)","SIDE OF ROAD/RAIL (L - LEFT, R - RIGHT)","Width of travelled way","Distance - Centreline to Edgeline/Edge of Seal","Distance of Tree from the Edgeline/Edge of Seal\n(Show in RED if behind Guard railing)","Clearance @ Edgeline OR Edge of Clearance Envelope",null,null,null,null,null,null,null,null,null,null,null,null,null,null,null,null,null,null,null,null,null,null,null,null,null,null,null,null,null,null,null,null,null,null,null,null,null,null,null,null,null,null,"WEED SPECIES & OTHERS (N; D; E; O; M)","Y\nN","Y\nN","Y\nN","Y\nN","REGULATED (R) OR REGULATED SIGNIFICANT TREES (S)",null,null,null,null,null,null,null,null,null,null,null,null,null,"%  DIEBACK","HOLLOWS (NUMBER)","HOLLOW ENTRANCE SIZE (METRES)",null,null,null,null,null,null,null,null,null,null,null,null,null,null,"NATIVE VEGETATION ACT\n(Y=YES for area)","DEVELOPMENT ACT","TRANSPORT SERVICES DIVISION\n(Y=YES for area)","DAC","Amenity",null,"Native veg. not covered by NVA",null,"NVA"]
[null,null,null,null,"VS 2017/???","Location :",null,null,null,null,null,null,null,null,null,null,"Off-set is Negated - eg DEAD vegetation with no habitat value","Veg is structurally unsound/within the Clearance Envelope etc","REGULATION 5(1)(lb) APPLIES","Area reporting selected in lieu of individual reporting",{"$f":"(SUMIF($BF$17:$BF$3789,\"Y\",$U$17:$U$3789))/10000","v":0},null,null,null,"COLUMN \"A\"","COLUMN \"B\"","COLUMN \"C\"",null,null,null,null,null,null,null,null,null,null,null,null,null,null,null,null,null,null,null,null,null,null,null,null,null,null,null,null,null,null,null,null,null,null,null,null,null,null,null,null,null,null,null,"APPROXIMATE TREE PROTECTION ZONE (TPZ)\nBUTT DIA. @ 1.0m x 12  ","TRUNK DIA. JUST ABOVE TREE BASE (m)","STRUCTURAL ROOT ZONE (SRZ) RADIUS (m)",null,null,null,"1. HEIGHT (WEIGHTED)","2. HEALTH (WEIGHTED)","HOLLOWS 1, 2 OR 3 POINTS","3. HOLLOWS (WEIGHTED)","SUITABILITY FOR THREATENED SPECIES ","4. THREATENED SPECIES (WEIGHTED)","DENSITY","5. DENSITY  (WEIGHTED)","PROXIMITY TO OTHER VEG","6. PROXIMITY TO OTHER VEG. (WEIGHTED)",null,null,null,null,null,null,null,"Number","Area (m2) - 1:1 Replacement","Number of Plants - 1:1 Replacement","Area (m2) - 2:1 Replacement","Number of Plants - 2:1 Replacement","Number - Regulation 5(1)(lb) Only","Area (ha)\n(Condition Score x Area)","Total SEB amount for Area to be Removed (Ha)","LGC AVERAGE LAND VALUE "]
[null,null,null,null,null,"Surveyed By : ",null,null,null,null,null,null,null,null,null,null,null,null,null,null,"TOTAL OTHER AREA (HA)",null,null,null,null,null,null,null,null,null,null,null,null,null,null,null,null,null,null,null,null,null,null,null,null,null,null,null,null,null,null,null,null,null,null,null,null,null,null,null,"TOTAL"]
["DATA SHEET - VE 105",null,null,null,null,"Date : ",null,null,null,null,null,null,null,null,null,null,null,null,null,null,null,null,null,"TOTAL",{"$f":"(SUMIF($BC$17:$BC$3833,\"D\",$AA$17:$AA$3833))+(SUMIF($BC$17:$BC$3833,\"E\",$AA$17:$AA$3833))+(SUMIF($BC$17:$BC$3833,\"O\",$AA$17:$AA$3833))","v":0},{"$f":"(SUMIF($BD$17:$BD$3833,\"Y\",$AA$17:$AA$3833))","v":0},{"$f":"SUMIF($BE$17:$BE$3833,\"Y\",$AA$17:$AA$3833)-(SUMIF($BF$17:$BF$3833,\"Y\",$AA$17:$AA$3833))","v":0},null,null,null,null,null,null,null,null,null,null,null,null,null,null,null,null,null,null,null,null,null,null,null,null,null,null,null,null,null,null,null,null,null,null,null,null,null,null,null,null,null,null,null,null,null,null,null,null,null,null,null,null,null,null,null,null,null,null,null,null,null,null,null,null,null,null,null,null,null,null,null,null,null,null,1]
["File No :  2017/",null,null,null,null,"Checked By : ???",null,null,null,null,null,null,null,null,null,null,null,null,null,null,{"$f":"(SUMIF($BF$17:$BF$3789,\"N\",$U17:$U$3789))/10000","v":0},null,null,null,"COLUMN \"D\"","COLUMN \"E\"","NUMBER IN GROUP",null,null,null,null,null,null,null,null,null,null,null,null,null,null,null,null,null,null,null,null,null,null,null,null,null,null,null,null,"Amenity Planting or has Amenity Value","NATIVE VEGETATION","SUBJECT TO NATIVE VEGETATION ACT","SUBJECT TO DEVELOPMENT ACT",null,"NO IN GROUP WITH BUTT DIA. 0.15+ OR MS 0.10+",null,null,null,null,null,null,null,null,"HEALTH & CONDITION *"]
["PATCHS No : ",null,null,null,null,"LOCAL GOVERNMENT COUNCIL(S) (LGC)",null,null,null,null,null,null,null,null,null,null,null,null,null,null,"AREA OF VEGETATION TO BE REMOVED (m2)",null,null,null,null,null,null,null,null,null,null,null,null,null,null,null,null,null,null,null,null,null,null,null,null,null,null,null,null,null,null,null,null,null,null,null,null,null,null,null,null,null,null,null,null,null,null,null,null,null,null,null,null,null,null,null,null,null,null,null,null,null,null,null,null,null,null,null,null,null,null,null,null,null,null,null,null,null,null,null,{"$f":"X2","v":0}]
["LGC (ALLOCATED NUMBER)","PLAN REFERENCE OR MM LOCATION","PHOTO REFERENCE",null,"IS THE SURVEY AREA COVERED BY EITHER OR BOTH OF THE FOLLOWING ACTS","1  -  ",null,null,null,null,null,null,null,null,null,null,null,null,null,null,null,null,null,"NVA SEB for AREA (HA)",{"$f":"(SUMIF($BF$17:$BF$3833,\"Y\",$AA$17:$AA$3833))","v":0},{"$f":"SUMIF($BG$17:$BG$3853,\"Y\",$BI$17:$BI$3853)","v":0},null,null,null,null,null,null,null,null,null,null,null,null,null,null,null,null,null,null,null,null,null,null,null,null,null,null,null,null,null,null,null,null,null,null,null,null,null,null,null,null,null,null,null,null,null,null,null,null,null,null,null,null,null,null,null,null,null,null,null,null,null,null,null,null,null,null,null,null,null,null,null,null,null,null,{"$f":"(SUMIF(#REF!,\"Y\",#REF!))/10000","v":{"$error":"#REF!"}},2]
[null,null,null,null,null,"2  -  ",null,null,null,null,null,null,null,null,null,null,null,null,null,null,null,null,null,null,"EASTING","NORTHING",null,null,null,null,null,null,null,null,null,null,null,null,null,null,null,null,null,null,null,null,null,null,null,null,null,null,null,null,null,null,null,null,null,null,null,null,null,null,null,null,null,null,null,null,null,null,null,null,null,null,null,null,null,null,null,null,null,null,null,null,null,null,null,null,null,null,null,null,null,null,null,null,null,null,"SEB Offset Area Requirement for Scattered Trees (Ha)"]
[null,null,null,null,"DEVELOPMENT ACT 1993?","3  -  ",null,null,null,null,null,null,"REMOVAL","MAJOR PRUNE","MINOR PRUNE","MONITOR",null,null,null,null,null,null,null,null,null,null,null,null,null,null,null,null,null,null,null,null,null,null,null,null,null,null,null,null,null,null,null,null,null,null,null,null,null,null,null,null,null,null,null,null,null,null,null,null,null,null,null,null,null,null,null,null,null,null,null,null,null,null,null,null,null,null,null,null,null,null,null,null,null,null,null,null,null,null,null,null,null,null,null,null,null,3]
[null,null,null,null,null,"4  -  "]
[null,null,null,null,"NATIVE VEGETATION ACT 1991?","5  -  ",null,null,null,null,null,null,null,null,null,null,null,null,null,null,null,null,null,null,null,null,null,null,null,null,null,null,null,null,null,null,null,null,null,null,null,null,null,null,null,null,null,null,null,null,null,null,null,null,null,null,null,null,null,null,null,null,null,null,null,null,null,null,null,null,null,null,null,null,null,null,null,null,null,null,null,null,null,null,null,null,null,null,"NO. \"False\"",null,null,null,null,null,null,null,null,null,null,null,null,"CANOPY AREA (HA)"]
[null,null,null,null,null,"6  -  "]
[null,null,null,null,"SPECIES OR GROUP/AREA DESCRIPTION","REMARKS/NOTES",null,null,null,null,null,null,null,null,null,null,null,null,null,null,null,null,null,null,null,null,null,null,null,null,null,null,null,null,null,null,null,null,null,null,null,null,null,null,null,null,null,null,null,null,null,null,null,null,null,null,null,null,null,null,null,null,null,null,null,null,null,null,null,null,null,null,null,null,null,null,null,null,null,null,null,null,null,null,null,null,null,null,{"$f":"SUMIF(CK17:CK3228,\"FALSE\",AA17:AA3228)","v":0},null,null,null,null,null,null,null,null,null,null,null,null,{"$f":"SUM(#REF!)+SUM(#REF!)","v":{"$error":"#REF!"}}]
[null,"Location","PhotoRef",null,"Species","Remarks",null,null,null,null,null,null,"Removal","MajPrun","MinPrun","Monitor",null,null,null,null,"Area",null,null,null,"East","North","Number",null,null,null,null,null,null,null,null,null,null,null,null,null,null,null,null,null,null,null,null,null,null,null,null,null,null,null,null,"Amenity","NatVeg","NVA","DAC","RegSig",null,null,null,null,null,null,null,null,null,null,"TPZ",null,"SRZ"]
[null,null,null,null,null,null,null,null,null,null,null,null,null,null,null,null,null,null,null,null,null,{"$f":"IF(S17=\"Y\",\"\",(IF(BF17=\"\",\"\",(IF(U17=\"\",\"\",(IF(BF17=\"N\",\"\",(IF(BF17=\"Y\",U17,)))))))))","v":""},null,{"$f":"IF(V17=\"\",\"\",(IF(BF17=\"N\",\"\",((V17*W17)/10000))))","v":""},null,null,null,{"$f":"IF(M17=\"\",0,(IF(T17=\"\",0,(IF(T17=\"Y\",0,(IF(S17=\"Y\",0, (IF(R17=\"Y\",0,(IF(BF17=\"N\",0,(IF(M17=\"P\",AA17)))))))))))))","v":0},{"$f":"IF(N17=\"\",0,(IF(T17=\"\",0,(IF(T17=\"Y\",0,(IF(S17=\"Y\",0, (IF(R17=\"Y\",0,(IF(BF17=\"N\",0,(IF(N17=\"P\",AA17)))))))))))))","v":0},{"$f":"IF(M17=\"\",0,(IF(T17=\"\",0,(IF(T17=\"N\",0,(IF(S17=\"Y\",0,(IF(BF17=\"N\",0,(IF(T17=\"Y\",(X17))))))))))))","v":0},{"$f":"IF(M17=\"\",0,(IF(T17=\"\",0,(IF(T17=\"Y\",0,(IF(S17=\"N\",0,(IF(BF17=\"N\",0,(IF(M17=\"P\",AA17)))))))))))","v":0},{"$f":"IF(N17=\"\",0,(IF(T17=\"\",0,(IF(T17=\"Y\",0,(IF(S17=\"N\",0, (IF(BF17=\"N\",0,(IF(N17=\"P\",AA17)))))))))))","v":0},{"$f":"IF(M17=\"\",0,(IF(T17=\"\",0,(IF(S17=\"N\",0,(IF(BF17=\"N\",0,(IF(T17=\"N\",0,(IF(T17=\"Y\",U17)))))))))))","v":0},{"$f":"IF(M17=\"\",0,(IF(T17=\"\",0,(IF(T17=\"Y\",0,(IF(S17=\"Y\",0,(IF(R17=\"N\",0,(IF(BF17=\"N\",0,(IF(M17=\"P\",AA17)))))))))))))","v":0},{"$f":"IF(N17=\"\",0,(IF(T17=\"\",0,(IF(T17=\"Y\",0,(IF(R17=\"N\",0, (IF(BF17=\"N\",0,(IF(N17=\"P\",AA17)))))))))))","v":0},{"$f":"IF(M17=\"\",0,(IF(BC17=\"N\",0,(IF(BD17=\"Y\",0,(IF(T17=\"Y\",0,(IF(BC17=\"E\",AA17,(IF(BC17=\"D\",AA17,(IF(BC17=\"O\",AA17,(IF(BC17=\"M\",AA17)))))))))))))))","v":0},{"$f":"IF(N17=\"\",0,(IF(BH17>0,0,(IF(BC17=\"N\",0,(IF(BD17=\"Y\",0,(IF(T17=\"Y\",0,(IF(BC17=\"E\",AA17,(IF(BC17=\"D\",AA17,(IF(BC17=\"O\",AA17,(IF(BC17=\"M\",AA17)))))))))))))))))","v":0},{"$f":"IF(M17=\"\",0,(IF(U17=\"\",0,(IF(BC17=\"N\",0,(IF(BD17=\"Y\",0,IF(T17=\"N\",0,(IF(BC17=\"E\",U17,(IF(BC17=\"D\",U17,(IF(BC17=\"O\",U17,(IF(BC17=\"M\",U17))))))))))))))))","v":0},{"$f":"(IF(M17=\"\",0,(IF(BE17=\"N\",0,(IF(BF17=\"Y\",0,(IF(BI17=0,0,(IF(BI17=\"\",\"\",(IF(Q17=\"Y\",0,(IF(R17=\"Y\",0,(IF(T17=\"Y\",0,(IF(BE17=\"Y\",AA17))))))))))))))))))","v":0},{"$f":"IF(N17=\"\",0,(IF(BE17=\"N\",0,(IF(BF17=\"Y\",0,(IF(BI17=0,0,(IF(BI17=\"\",0,(IF(Q17=\"Y\",0,(IF(R17=\"Y\",0,(IF(T17=\"Y\",0,(IF(BE17=\"Y\",AA17)))))))))))))))))","v":0},{"$f":"IF(M17=\"\",0,(IF(U17=\"\",0,(IF(T17=\"N\",0,(IF(BE17=\"N\",0,(IF(BF17=\"Y\",0,(IF(BE17=\"Y\",U17)))))))))))","v":0},{"$f":"(IF(M17=\"\",0,(IF(T17=\"Y\",0,(IF(S17=\"Y\",0,(IF(BD17=\"Y\",0,(IF(BE17=\"N\",0,(IF(BF17=\"Y\",0,(IF(BI17=0,0,(IF(BI17=\"\",\"\",(IF(R17=\"N\",0,(IF(R17=\"Y\",AA17))))))))))))))))))))+(IF(M17=\"\",0,(IF(R17=\"Y\",0,(IF(T17=\"Y\",0,(IF(S17=\"Y\",0,(IF(BD17=\"Y\",0,(IF(BE17=\"N\",0,(IF(BF17=\"Y\",0,(IF(BI17=0,0,(IF(BI17=\"\",\"\",(IF(Q17=\"Y\",AA17))))))))))))))))))))","v":0},{"$f":"(IF(N17=\"\",0,(IF(T17=\"\",0,(IF(T17=\"Y\",0,(IF(R17=\"N\",0, (IF(BF17=\"Y\",0,(IF(BE17=\"N\",0,(IF(BI17=0,0,(IF(BI17=\"\",\"\",(IF(R17=\"Y\",AA17))))))))))))))))))+(IF(N17=\"\",0,(IF(T17=\"\",0,(IF(T17=\"Y\",0,(IF(R17=\"Y\",0, (IF(BF17=\"Y\",0,(IF(BE17=\"N\",0,(IF(BI17=0,0,(IF(BI17=\"\",\"\",(IF(Q17=\"Y\",AA17))))))))))))))))))","v":0},{"$f":"(IF(M17=\"\",0,(IF(T17=\"Y\",0,(IF(BG17=\"Y\",0,(IF(BD17=\"N\",0,(IF(Q17=\"Y\",0,(IF(R17=\"Y\",0,(IF(BD17=\"Y\",AA17))))))))))))))","v":0},{"$f":"IF(N17=\"\",0,(IF(BD17=\"\",0,(IF(BD17=\"N\",0,(IF(BH17>0,0,(IF(T17=\"Y\",0,(IF(R17=\"Y\",0,(IF(Q17=\"Y\",0,(IF(BD17=\"Y\",AA17)))))))))))))))","v":0},{"$f":"IF(M17=\"\",0,(IF(BD17=\"\",0,(IF(BD17=\"N\",0,(IF(T17=\"N\",0,(IF(Q17=\"Y\",0,(IF(BD17=\"Y\",U17)))))))))))","v":0},{"$f":"(IF(M17=\"\",0,(IF(T17=\"\",0,(IF(T17=\"Y\",0,(IF(S17=\"Y\",0,(IF(R17=\"N\",0,(IF(BD17=\"N\",0,(IF(BE17=\"Y\",0,(IF(R17=\"Y\",AA17))))))))))))))))+(IF(R17=\"Y\",0,(IF(M17=\"\",0,(IF(BD17=\"N\",0,(IF(T17=\"\",0,(IF(T17=\"Y\",0,(IF(S17=\"Y\",0,(IF(BE17=\"Y\",0,(IF(Q17=\"Y\",AA17))))))))))))))))","v":0},{"$f":"(IF(N17=\"\",0,(IF(T17=\"\",0,(IF(T17=\"Y\",0,(IF(R17=\"N\",0,(IF(S17=\"Y\",0,(IF(BE17=\"Y\",0,(IF(BD17=\"N\",0,(IF(R17=\"Y\",AA17))))))))))))))))+(IF(R17=\"Y\",0,(IF(N17=\"\",0,(IF(T17=\"\",0,(IF(T17=\"Y\",0,(IF(S17=\"Y\",0,(IF(BE17=\"Y\",0,(IF(BD17=\"N\",0,(IF(Q17=\"Y\",AA17))))))))))))))))","v":0},{"$f":"IF(M17=\"\",0,(IF(BF17=\"Y\",0,(IF(BH17=\"\",0,(IF(BG17=\"N\",0,(IF(BH17=\"R\",0,(IF(BH17=\"S\",AA17)))))))))))","v":0},{"$f":"(IF(AW17=0,0,AW17))*3","v":0},{"$f":"IF(N17=\"\",0,(IF(BF17=\"Y\",0,(IF(BG17=\"N\",0,(IF(BH17=\"R\",0,(IF(BH17=\"S\",AA17)))))))))","v":0},{"$f":"IF(M17=\"\",0,(IF(BF17=\"Y\",0,(IF(BG17=\"N\",0,(IF(BH17=\"\",0,(IF(BH17=\"S\",0,(IF(BH17=\"R\",AA17)))))))))))","v":0},{"$f":"(IF(AZ17=0,0,AZ17))*2","v":0},{"$f":"IF(N17=\"\",0,(IF(BF17=\"Y\",0,(IF(BG17=\"N\",0,(IF(BH17=\"S\",0,(IF(BH17=\"R\",AA17)))))))))","v":0},null,null,null,null,null,null,null,null,null,null,null,null,null,null,null,null,{"$f":"IF(BK17=\"\",\"\",(BK17*12))","v":""},null,{"$f":"(IF(BT17=\"\",\"\",((BT17*50)^0.42)*0.64))","v":""},null,null,null,{"$f":"IF(BF17=\"\",\"\",(IF(BF17=\"N\",\"\",(IF(BF17=\"Y\",(IF(BN17=\"\",\"\",(IF($BN17<10,1,(IF($BN17<20,2,3))))*1.05)))))))","v":""},{"$f":"IF(BV17=\"\",\"\",(IF(BF17=\"N\",\"\",(IF(BF17=\"Y\",((100-$BV17)*0.04)+2)))))","v":""},null,{"$f":"IF(CA17=\"\",\"\",(IF(BF17=\"N\",\"\",(IF(BF17=\"Y\",(CA17*1.45))))))","v":""},null,{"$f":"IF(CC17=\"\",\"\",(IF(BF17=\"N\",\"\",(IF(BF17=\"Y\",(CC17*0.65))))))","v":""},null,{"$f":"IF(CE17=\"\",\"\",(IF(BF17=\"N\",\"\",(IF(BF17=\"Y\",(CE17*0.4))))))","v":""},null,{"$f":"IF(CG17=\"\",\"\",(IF(BF17=\"N\",\"\",(IF(BF17=\"Y\",(CG17*0.35))))))","v":""},{"$f":"IF(BY17=\"\",\"\",(SUM(BY17,BZ17,CB17,CD17,CF17,CH17)*SUM(BY17,BZ17,CB17,CD17,CF17,CH17)*SUM(BY17,BZ17,CB17,CD17,CF17,CH17)/55.5))","v":""},{"$f":"IF(CI17=\"\",\"\",IF(CI17<30,0,(IF(CI17>=30,1))))","v":""},{"$f":"IF(CI17=\"\",\"\",(IF(CJ17=1,CJ17=\"@\",(IF(CJ17=0,(IF($CI17<20,4*$CI17/550,(IF($CI17<30,6*$CI17/550,(IF($CI17<41,8*$CI17/550,(IF($CI17<61,10*$CI17/550,12*$CI17/550)))))))))))))","v":""},{"$f":"IF(CI17=\"\",\"\",((IF($CI17<20,4*$CI17/550,(IF($CI17<29.1,6*$CI17/550,(IF($CI17<40.1,8*$CI17/550,(IF($CI17<60.1,10*$CI17/550,12*$CI17/550))))))))*AA17))","v":""},{"$f":"IF(BF17=\"\",\"\",(IF(BF17=\"N\",\"\",(IF(T17=\"Y\",\"Y\",(IF(AA17=\"\",\"Y\",(IF(AA17=0,\"\",(IF(BF17=\"Y\",(AB17+AC17+AE17+AF17+AH17+AI17))))))))))))","v":""},{"$f":"IF(BG17=\"\",\"\",(IF(BG17=\"N\",\"\",(IF(BF17=\"Y\",\"\",(IF(Q17=\"Y\",\"\",(IF(BG17=\"Y\",(AW17+AY17+AZ17+BB17))))))))))","v":""},{"$f":"(IF(BF17=\"Y\",\"\",(IF(BG17=\"Y\",\"\",(IF(AL17>0,\"\",(IF(T17=\"Y\",\"Y\",(IF(AA17=\"\",\"\",(IF(AJ17>0,BI17,(IF(AK17>0,BI17,(AM17+AN17+AR17+AS17+AU17+AV17+AP17+AQ17)))))))))))))))","v":""},{"$f":"(IF(AA17=\"\",\"\",(IF(M17=\"\",\"\",(IF(Q17=\"Y\",\"\",(IF(BG17=\"N\",\"\",(IF(BF17=\"Y\",\"\",(IF(BG17=\"Y\",(AX17+BA17)))))))))))))","v":""},{"$f":"IF(AT17=0,\"\",(IF(AQ17=\"Y\",\"\",(AT17))))","v":""},{"$f":"IF(AA17=\"\",\"\",(IF(Q17=\"Y\",\"\",(IF(AR17=0,\"\",(AR17))))))","v":""},{"$f":"IF(AO17=0,\"\",(IF(Q17=\"Y\",\"\",(AO17*2))))","v":""},{"$f":"IF(AM17=0,\"\",(IF(Q17=\"Y\",\"\",(AM17*2))))","v":""},{"$f":"(IF(AE17=0,\"\",(IF(Q17=\"Y\",\"\",(AE17*2)))))","v":""},{"$f":"IF(AD17=0,\"\",(IF(Q17=\"Y\",\"\",(AD17))))","v":""},{"$f":"IF(BN17=\"\",\"\",(IF(S17=\"Y\",\"\",(IF(R17=\"Y\",\"\",(IF(Q17=\"Y\",\"\",(IF(T17=\"Y\",\"\",(IF(BF17=\"\",\"\",(IF(BF17=\"N\",\"\",(CL17))))))))))))))","v":""},{"$f":"IF(BF17=\"\",\"\",(IF(BF17=\"N\",\"\",(IF(BP17=\"\",\"\",(IF(R17=\"Y\",\"\",(IF(T17=\"Y\",\"\",(IF($CY$6=\"\",\"\",(IF(AA17=\"\",\"\",(PI()*((BP17/2)*(BP17/2)))/10000*AA17)))))))))))))","v":""}]
[null,null,null,null,null,null,null,null,null,null,null,null,null,null,null,null,null,null,null,null,null,"",null,{"$f":"IF(V18=\"\",\"\",(IF(BF18=\"N\",\"\",((V18*W18)/10000))))","v":""},null,null,null,{"$f":"IF(M18=\"\",0,(IF(T18=\"\",0,(IF(T18=\"Y\",0,(IF(S18=\"Y\",0, (IF(R18=\"Y\",0,(IF(BF18=\"N\",0,(IF(M18=\"P\",AA18)))))))))))))","v":0},{"$f":"IF(N18=\"\",0,(IF(T18=\"\",0,(IF(T18=\"Y\",0,(IF(S18=\"Y\",0, (IF(R18=\"Y\",0,(IF(BF18=\"N\",0,(IF(N18=\"P\",AA18)))))))))))))","v":0},{"$f":"IF(M18=\"\",0,(IF(T18=\"\",0,(IF(T18=\"N\",0,(IF(S18=\"Y\",0,(IF(BF18=\"N\",0,(IF(T18=\"Y\",(X18))))))))))))","v":0},{"$f":"IF(M18=\"\",0,(IF(T18=\"\",0,(IF(T18=\"Y\",0,(IF(S18=\"N\",0,(IF(BF18=\"N\",0,(IF(M18=\"P\",AA18)))))))))))","v":0},{"$f":"IF(N18=\"\",0,(IF(T18=\"\",0,(IF(T18=\"Y\",0,(IF(S18=\"N\",0, (IF(BF18=\"N\",0,(IF(N18=\"P\",AA18)))))))))))","v":0},{"$f":"IF(M18=\"\",0,(IF(T18=\"\",0,(IF(S18=\"N\",0,(IF(BF18=\"N\",0,(IF(T18=\"N\",0,(IF(T18=\"Y\",U18)))))))))))","v":0},{"$f":"IF(M18=\"\",0,(IF(T18=\"\",0,(IF(T18=\"Y\",0,(IF(S18=\"Y\",0,(IF(R18=\"N\",0,(IF(BF18=\"N\",0,(IF(M18=\"P\",AA18)))))))))))))","v":0},{"$f":"IF(N18=\"\",0,(IF(T18=\"\",0,(IF(T18=\"Y\",0,(IF(R18=\"N\",0, (IF(BF18=\"N\",0,(IF(N18=\"P\",AA18)))))))))))","v":0},{"$f":"IF(M18=\"\",0,(IF(BC18=\"N\",0,(IF(BD18=\"Y\",0,(IF(T18=\"Y\",0,(IF(BC18=\"E\",AA18,(IF(BC18=\"D\",AA18,(IF(BC18=\"O\",AA18,(IF(BC18=\"M\",AA18)))))))))))))))","v":0},{"$f":"IF(N18=\"\",0,(IF(BH18>0,0,(IF(BC18=\"N\",0,(IF(BD18=\"Y\",0,(IF(T18=\"Y\",0,(IF(BC18=\"E\",AA18,(IF(BC18=\"D\",AA18,(IF(BC18=\"O\",AA18,(IF(BC18=\"M\",AA18)))))))))))))))))","v":0},{"$f":"IF(M18=\"\",0,(IF(U18=\"\",0,(IF(BC18=\"N\",0,(IF(BD18=\"Y\",0,IF(T18=\"N\",0,(IF(BC18=\"E\",U18,(IF(BC18=\"D\",U18,(IF(BC18=\"O\",U18,(IF(BC18=\"M\",U18))))))))))))))))","v":0},{"$f":"(IF(M18=\"\",0,(IF(BE18=\"N\",0,(IF(BF18=\"Y\",0,(IF(BI18=0,0,(IF(BI18=\"\",\"\",(IF(Q18=\"Y\",0,(IF(R18=\"Y\",0,(IF(T18=\"Y\",0,(IF(BE18=\"Y\",AA18))))))))))))))))))","v":0},{"$f":"IF(N18=\"\",0,(IF(BE18=\"N\",0,(IF(BF18=\"Y\",0,(IF(BI18=0,0,(IF(BI18=\"\",0,(IF(Q18=\"Y\",0,(IF(R18=\"Y\",0,(IF(T18=\"Y\",0,(IF(BE18=\"Y\",AA18)))))))))))))))))","v":0},{"$f":"IF(M18=\"\",0,(IF(U18=\"\",0,(IF(T18=\"N\",0,(IF(BE18=\"N\",0,(IF(BF18=\"Y\",0,(IF(BE18=\"Y\",U18)))))))))))","v":0},{"$f":"(IF(M18=\"\",0,(IF(T18=\"Y\",0,(IF(S18=\"Y\",0,(IF(BD18=\"Y\",0,(IF(BE18=\"N\",0,(IF(BF18=\"Y\",0,(IF(BI18=0,0,(IF(BI18=\"\",\"\",(IF(R18=\"N\",0,(IF(R18=\"Y\",AA18))))))))))))))))))))+(IF(M18=\"\",0,(IF(R18=\"Y\",0,(IF(T18=\"Y\",0,(IF(S18=\"Y\",0,(IF(BD18=\"Y\",0,(IF(BE18=\"N\",0,(IF(BF18=\"Y\",0,(IF(BI18=0,0,(IF(BI18=\"\",\"\",(IF(Q18=\"Y\",AA18))))))))))))))))))))","v":0},{"$f":"(IF(N18=\"\",0,(IF(T18=\"\",0,(IF(T18=\"Y\",0,(IF(R18=\"N\",0, (IF(BF18=\"Y\",0,(IF(BE18=\"N\",0,(IF(BI18=0,0,(IF(BI18=\"\",\"\",(IF(R18=\"Y\",AA18))))))))))))))))))+(IF(N18=\"\",0,(IF(T18=\"\",0,(IF(T18=\"Y\",0,(IF(R18=\"Y\",0, (IF(BF18=\"Y\",0,(IF(BE18=\"N\",0,(IF(BI18=0,0,(IF(BI18=\"\",\"\",(IF(Q18=\"Y\",AA18))))))))))))))))))","v":0},{"$f":"(IF(M18=\"\",0,(IF(T18=\"Y\",0,(IF(BG18=\"Y\",0,(IF(BD18=\"N\",0,(IF(Q18=\"Y\",0,(IF(R18=\"Y\",0,(IF(BD18=\"Y\",AA18))))))))))))))","v":0},{"$f":"IF(N18=\"\",0,(IF(BD18=\"\",0,(IF(BD18=\"N\",0,(IF(BH18>0,0,(IF(T18=\"Y\",0,(IF(R18=\"Y\",0,(IF(Q18=\"Y\",0,(IF(BD18=\"Y\",AA18)))))))))))))))","v":0},{"$f":"IF(M18=\"\",0,(IF(BD18=\"\",0,(IF(BD18=\"N\",0,(IF(T18=\"N\",0,(IF(Q18=\"Y\",0,(IF(BD18=\"Y\",U18)))))))))))","v":0},{"$f":"(IF(M18=\"\",0,(IF(T18=\"\",0,(IF(T18=\"Y\",0,(IF(S18=\"Y\",0,(IF(R18=\"N\",0,(IF(BD18=\"N\",0,(IF(BE18=\"Y\",0,(IF(R18=\"Y\",AA18))))))))))))))))+(IF(R18=\"Y\",0,(IF(M18=\"\",0,(IF(BD18=\"N\",0,(IF(T18=\"\",0,(IF(T18=\"Y\",0,(IF(S18=\"Y\",0,(IF(BE18=\"Y\",0,(IF(Q18=\"Y\",AA18))))))))))))))))","v":0},{"$f":"(IF(N18=\"\",0,(IF(T18=\"\",0,(IF(T18=\"Y\",0,(IF(R18=\"N\",0,(IF(S18=\"Y\",0,(IF(BE18=\"Y\",0,(IF(BD18=\"N\",0,(IF(R18=\"Y\",AA18))))))))))))))))+(IF(R18=\"Y\",0,(IF(N18=\"\",0,(IF(T18=\"\",0,(IF(T18=\"Y\",0,(IF(S18=\"Y\",0,(IF(BE18=\"Y\",0,(IF(BD18=\"N\",0,(IF(Q18=\"Y\",AA18))))))))))))))))","v":0},{"$f":"IF(M18=\"\",0,(IF(BF18=\"Y\",0,(IF(BH18=\"\",0,(IF(BG18=\"N\",0,(IF(BH18=\"R\",0,(IF(BH18=\"S\",AA18)))))))))))","v":0},{"$f":"(IF(AW18=0,0,AW18))*3","v":0},{"$f":"IF(N18=\"\",0,(IF(BF18=\"Y\",0,(IF(BG18=\"N\",0,(IF(BH18=\"R\",0,(IF(BH18=\"S\",AA18)))))))))","v":0},{"$f":"IF(M18=\"\",0,(IF(BF18=\"Y\",0,(IF(BG18=\"N\",0,(IF(BH18=\"\",0,(IF(BH18=\"S\",0,(IF(BH18=\"R\",AA18)))))))))))","v":0},{"$f":"(IF(AZ18=0,0,AZ18))*2","v":0},{"$f":"IF(N18=\"\",0,(IF(BF18=\"Y\",0,(IF(BG18=\"N\",0,(IF(BH18=\"S\",0,(IF(BH18=\"R\",AA18)))))))))","v":0},null,null,null,null,null,null,null,null,null,null,null,null,null,null,null,null,{"$f":"IF(BK18=\"\",\"\",(BK18*12))","v":""},null,{"$f":"(IF(BT18=\"\",\"\",((BT18*50)^0.42)*0.64))","v":""},null,null,null,{"$f":"IF(BF18=\"\",\"\",(IF(BF18=\"N\",\"\",(IF(BF18=\"Y\",(IF(BN18=\"\",\"\",(IF($BN18<10,1,(IF($BN18<20,2,3))))*1.05)))))))","v":""},{"$f":"IF(BV18=\"\",\"\",(IF(BF18=\"N\",\"\",(IF(BF18=\"Y\",((100-$BV18)*0.04)+2)))))","v":""},null,{"$f":"IF(CA18=\"\",\"\",(IF(BF18=\"N\",\"\",(IF(BF18=\"Y\",(CA18*1.45))))))","v":""},null,{"$f":"IF(CC18=\"\",\"\",(IF(BF18=\"N\",\"\",(IF(BF18=\"Y\",(CC18*0.65))))))","v":""},null,{"$f":"IF(CE18=\"\",\"\",(IF(BF18=\"N\",\"\",(IF(BF18=\"Y\",(CE18*0.4))))))","v":""},null,{"$f":"IF(CG18=\"\",\"\",(IF(BF18=\"N\",\"\",(IF(BF18=\"Y\",(CG18*0.35))))))","v":""},{"$f":"IF(BY18=\"\",\"\",(SUM(BY18,BZ18,CB18,CD18,CF18,CH18)*SUM(BY18,BZ18,CB18,CD18,CF18,CH18)*SUM(BY18,BZ18,CB18,CD18,CF18,CH18)/55.5))","v":""},{"$f":"IF(CI18=\"\",\"\",IF(CI18<30,0,(IF(CI18>=30,1))))","v":""},{"$f":"IF(CI18=\"\",\"\",(IF(CJ18=1,CJ18=\"@\",(IF(CJ18=0,(IF($CI18<20,4*$CI18/550,(IF($CI18<30,6*$CI18/550,(IF($CI18<41,8*$CI18/550,(IF($CI18<61,10*$CI18/550,12*$CI18/550)))))))))))))","v":""},{"$f":"IF(CI18=\"\",\"\",((IF($CI18<20,4*$CI18/550,(IF($CI18<29.1,6*$CI18/550,(IF($CI18<40.1,8*$CI18/550,(IF($CI18<60.1,10*$CI18/550,12*$CI18/550))))))))*AA18))","v":""},{"$f":"IF(BF18=\"\",\"\",(IF(BF18=\"N\",\"\",(IF(T18=\"Y\",\"Y\",(IF(AA18=\"\",\"Y\",(IF(AA18=0,\"\",(IF(BF18=\"Y\",(AB18+AC18+AE18+AF18+AH18+AI18))))))))))))","v":""},{"$f":"IF(BG18=\"\",\"\",(IF(BG18=\"N\",\"\",(IF(BF18=\"Y\",\"\",(IF(Q18=\"Y\",\"\",(IF(BG18=\"Y\",(AW18+AY18+AZ18+BB18))))))))))","v":""},{"$f":"(IF(BF18=\"Y\",\"\",(IF(BG18=\"Y\",\"\",(IF(AL18>0,\"\",(IF(T18=\"Y\",\"Y\",(IF(AA18=\"\",\"\",(IF(AJ18>0,BI18,(IF(AK18>0,BI18,(AM18+AN18+AR18+AS18+AU18+AV18+AP18+AQ18)))))))))))))))","v":""},{"$f":"(IF(AA18=\"\",\"\",(IF(M18=\"\",\"\",(IF(Q18=\"Y\",\"\",(IF(BG18=\"N\",\"\",(IF(BF18=\"Y\",\"\",(IF(BG18=\"Y\",(AX18+BA18)))))))))))))","v":""},{"$f":"IF(AT18=0,\"\",(IF(AQ18=\"Y\",\"\",(AT18))))","v":""},{"$f":"IF(AA18=\"\",\"\",(IF(Q18=\"Y\",\"\",(IF(AR18=0,\"\",(AR18))))))","v":""},{"$f":"IF(AO18=0,\"\",(IF(Q18=\"Y\",\"\",(AO18*2))))","v":""},{"$f":"IF(AM18=0,\"\",(IF(Q18=\"Y\",\"\",(AM18*2))))","v":""},{"$f":"(IF(AE18=0,\"\",(IF(Q18=\"Y\",\"\",(AE18*2)))))","v":""},{"$f":"IF(AD18=0,\"\",(IF(Q18=\"Y\",\"\",(AD18))))","v":""},{"$f":"IF(BN18=\"\",\"\",(IF(S18=\"Y\",\"\",(IF(R18=\"Y\",\"\",(IF(Q18=\"Y\",\"\",(IF(T18=\"Y\",\"\",(IF(BF18=\"\",\"\",(IF(BF18=\"N\",\"\",(CL18))))))))))))))","v":""},{"$f":"IF(BF18=\"\",\"\",(IF(BF18=\"N\",\"\",(IF(BP18=\"\",\"\",(IF(R18=\"Y\",\"\",(IF(T18=\"Y\",\"\",(IF($CY$6=\"\",\"\",(IF(AA18=\"\",\"\",(PI()*((BP18/2)*(BP18/2)))/10000*AA18)))))))))))))","v":""}]
[null,null,null,null,null,null,null,null,null,null,null,null,null,null,null,null,null,null,null,null,null,"",null,"",null,null,null,0,0,0,0,0,0,0,0,0,0,0,0,0,0,0,0,0,0,0,0,0,0,0,0,0,0,0,null,null,null,null,null,null,null,null,null,null,null,null,null,null,null,null,"",null,"",null,null,null,"","",null,"",null,"",null,"",null,"","","","","","","","","","","","","","","","",""]
[null,null,null,null,null,null,null,null,null,null,null,null,null,null,null,null,null,null,null,null,null,{"$f":"IF(S20=\"Y\",\"\",(IF(BF20=\"\",\"\",(IF(U20=\"\",\"\",(IF(BF20=\"N\",\"\",(IF(BF20=\"Y\",U20,)))))))))","v":""},null,"",null,null,null,0,0,0,0,0,0,0,0,0,0,0,0,0,0,0,0,0,0,0,0,0,0,0,0,0,0,0,null,null,null,null,null,null,null,null,null,null,null,null,null,null,null,null,"",null,"",null,null,null,"","",null,"",null,"",null,"",null,"","","","","","","","","","","","","","","","",""]
[null,null,null,null,null,null,null,null,null,null,null,null,null,null,null,null,null,null,null,null,null,{"$f":"IF(S21=\"Y\",\"\",(IF(BF21=\"\",\"\",(IF(U21=\"\",\"\",(IF(BF21=\"N\",\"\",(IF(BF21=\"Y\",U21,)))))))))","v":""},null,"",null,null,null,0,0,0,0,0,0,0,0,0,0,0,0,0,0,0,0,0,0,0,0,0,0,0,0,0,0,0,null,null,null,null,null,null,null,null,null,null,null,null,null,null,null,null,"",null,"",null,null,null,"","",null,"",null,"",null,"",null,"","","","","","","","","","","","","","","","",""]
[null,null,null,null,null,null,null,null,null,null,null,null,null,null,null,null,null,null,null,null,null,"",null,"",null,null,null,0,0,0,0,0,0,0,0,0,0,0,0,0,0,0,0,0,0,0,0,0,0,0,0,0,0,0,null,null,null,null,null,null,null,null,null,null,null,null,null,null,null,null,"",null,"",null,null,null,"","",null,"",null,"",null,"",null,"","","","","","","","","","","","","","","","",""]
[null,null,null,null,null,null,null,null,null,null,null,null,null,null,null,null,null,null,null,null,null,"",null,"",null,null,null,0,0,0,0,0,0,0,0,0,0,0,0,0,0,0,0,0,0,0,0,0,0,0,0,0,0,0,null,null,null,null,null,null,null,null,null,null,null,null,null,null,null,null,"",null,"",null,null,null,"","",null,"",null,"",null,"",null,"","","","","","","","","","","","","","","","",""]
[null,null,null,null,null,null,null,null,null,null,null,null,null,null,null,null,null,null,null,null,null,"",null,"",null,null,null,0,0,0,0,0,0,0,0,0,0,0,0,0,0,0,0,0,0,0,0,0,0,0,0,0,0,0,null,null,null,null,null,null,null,null,null,null,null,null,null,null,null,null,"",null,"",null,null,null,"","",null,"",null,"",null,"",null,"","","","","","","","","","","","","","","","",""]
[null,null,null,null,null,null,null,null,null,null,null,null,null,null,null,null,null,null,null,null,null,"",null,"",null,null,null,0,0,0,0,0,0,0,0,0,0,0,0,0,0,0,0,0,0,0,0,0,0,0,0,0,0,0,null,null,null,null,null,null,null,null,null,null,null,null,null,null,null,null,"",null,"",null,null,null,"","",null,"",null,"",null,"",null,"","","","","","","","","","","","","","","","",""]
[null,null,null,null,null,null,null,null,null,null,null,null,null,null,null,null,null,null,null,null,null,"",null,"",null,null,null,0,0,0,0,0,0,0,0,0,0,0,0,0,0,0,0,0,0,0,0,0,0,0,0,0,0,0,null,null,null,null,null,null,null,null,null,null,null,null,null,null,null,null,"",null,"",null,null,null,"","",null,"",null,"",null,"",null,"","","","","","","","","","","","","","","","",""]
[null,null,null,null,null,null,null,null,null,null,null,null,null,null,null,null,null,null,null,null,null,"",null,"",null,null,null,0,0,0,0,0,0,0,0,0,0,0,0,0,0,0,0,0,0,0,0,0,0,0,0,0,0,0,null,null,null,null,null,null,null,null,null,null,null,null,null,null,null,null,"",null,"",null,null,null,"","",null,"",null,"",null,"",null,"","","","","","","","","","","","","","","","",""]
[null,null,null,null,null,null,null,null,null,null,null,null,null,null,null,null,null,null,null,null,null,"",null,{"$f":"IF(V28=\"\",\"\",(IF(BF28=\"N\",\"\",((V28*W28)/10000))))","v":""},null,null,null,0,0,0,0,0,0,0,0,0,0,0,0,0,0,0,0,0,0,0,0,0,0,0,0,0,0,0,null,null,null,null,null,null,null,null,null,null,null,null,null,null,null,null,"",null,"",null,null,null,"","",null,"",null,"",null,"",null,"","","","",{"$f":"IF(CI28=\"\",\"\",((IF($CI28<20,4*$CI28/550,(IF($CI28<29.1,6*$CI28/550,(IF($CI28<40.1,8*$CI28/550,(IF($CI28<60.1,10*$CI28/550,12*$CI28/550))))))))*AA28))","v":""},{"$f":"IF(BF28=\"\",\"\",(IF(BF28=\"N\",\"\",(IF(T28=\"Y\",\"Y\",(IF(AA28=\"\",\"Y\",(IF(AA28=0,\"\",(IF(BF28=\"Y\",(AB28+AC28+AE28+AF28+AH28+AI28))))))))))))","v":""},{"$f":"IF(BG28=\"\",\"\",(IF(BG28=\"N\",\"\",(IF(BF28=\"Y\",\"\",(IF(Q28=\"Y\",\"\",(IF(BG28=\"Y\",(AW28+AY28+AZ28+BB28))))))))))","v":""},{"$f":"(IF(BF28=\"Y\",\"\",(IF(BG28=\"Y\",\"\",(IF(AL28>0,\"\",(IF(T28=\"Y\",\"Y\",(IF(AA28=\"\",\"\",(IF(AJ28>0,BI28,(IF(AK28>0,BI28,(AM28+AN28+AR28+AS28+AU28+AV28+AP28+AQ28)))))))))))))))","v":""},{"$f":"(IF(AA28=\"\",\"\",(IF(M28=\"\",\"\",(IF(Q28=\"Y\",\"\",(IF(BG28=\"N\",\"\",(IF(BF28=\"Y\",\"\",(IF(BG28=\"Y\",(AX28+BA28)))))))))))))","v":""},"",{"$f":"IF(AA28=\"\",\"\",(IF(Q28=\"Y\",\"\",(IF(AR28=0,\"\",(AR28))))))","v":""},{"$f":"IF(AO28=0,\"\",(IF(Q28=\"Y\",\"\",(AO28*2))))","v":""},{"$f":"IF(AM28=0,\"\",(IF(Q28=\"Y\",\"\",(AM28*2))))","v":""},"","",{"$f":"IF(BN28=\"\",\"\",(IF(S28=\"Y\",\"\",(IF(R28=\"Y\",\"\",(IF(Q28=\"Y\",\"\",(IF(T28=\"Y\",\"\",(IF(BF28=\"\",\"\",(IF(BF28=\"N\",\"\",(CL28))))))))))))))","v":""},{"$f":"IF(BF28=\"\",\"\",(IF(BF28=\"N\",\"\",(IF(BP28=\"\",\"\",(IF(R28=\"Y\",\"\",(IF(T28=\"Y\",\"\",(IF($CY$6=\"\",\"\",(IF(AA28=\"\",\"\",(PI()*((BP28/2)*(BP28/2)))/10000*AA28)))))))))))))","v":""}]
[null,null,null,null,null,null,null,null,null,null,null,null,null,null,null,null,null,null,null,null,null,"",null,{"$f":"IF(V29=\"\",\"\",(IF(BF29=\"N\",\"\",((V29*W29)/10000))))","v":""},null,null,null,0,0,0,0,0,0,0,0,0,0,0,0,0,0,0,0,0,0,0,0,0,0,0,0,0,0,0,null,null,null,null,null,null,null,null,null,null,null,null,null,null,null,null,"",null,"",null,null,null,"","",null,"",null,"",null,"",null,"","","","",{"$f":"IF(CI29=\"\",\"\",((IF($CI29<20,4*$CI29/550,(IF($CI29<29.1,6*$CI29/550,(IF($CI29<40.1,8*$CI29/550,(IF($CI29<60.1,10*$CI29/550,12*$CI29/550))))))))*AA29))","v":""},{"$f":"IF(BF29=\"\",\"\",(IF(BF29=\"N\",\"\",(IF(T29=\"Y\",\"Y\",(IF(AA29=\"\",\"Y\",(IF(AA29=0,\"\",(IF(BF29=\"Y\",(AB29+AC29+AE29+AF29+AH29+AI29))))))))))))","v":""},{"$f":"IF(BG29=\"\",\"\",(IF(BG29=\"N\",\"\",(IF(BF29=\"Y\",\"\",(IF(Q29=\"Y\",\"\",(IF(BG29=\"Y\",(AW29+AY29+AZ29+BB29))))))))))","v":""},{"$f":"(IF(BF29=\"Y\",\"\",(IF(BG29=\"Y\",\"\",(IF(AL29>0,\"\",(IF(T29=\"Y\",\"Y\",(IF(AA29=\"\",\"\",(IF(AJ29>0,BI29,(IF(AK29>0,BI29,(AM29+AN29+AR29+AS29+AU29+AV29+AP29+AQ29)))))))))))))))","v":""},{"$f":"(IF(AA29=\"\",\"\",(IF(M29=\"\",\"\",(IF(Q29=\"Y\",\"\",(IF(BG29=\"N\",\"\",(IF(BF29=\"Y\",\"\",(IF(BG29=\"Y\",(AX29+BA29)))))))))))))","v":""},"",{"$f":"IF(AA29=\"\",\"\",(IF(Q29=\"Y\",\"\",(IF(AR29=0,\"\",(AR29))))))","v":""},{"$f":"IF(AO29=0,\"\",(IF(Q29=\"Y\",\"\",(AO29*2))))","v":""},{"$f":"IF(AM29=0,\"\",(IF(Q29=\"Y\",\"\",(AM29*2))))","v":""},"","",{"$f":"IF(BN29=\"\",\"\",(IF(S29=\"Y\",\"\",(IF(R29=\"Y\",\"\",(IF(Q29=\"Y\",\"\",(IF(T29=\"Y\",\"\",(IF(BF29=\"\",\"\",(IF(BF29=\"N\",\"\",(CL29))))))))))))))","v":""},{"$f":"IF(BF29=\"\",\"\",(IF(BF29=\"N\",\"\",(IF(BP29=\"\",\"\",(IF(R29=\"Y\",\"\",(IF(T29=\"Y\",\"\",(IF($CY$6=\"\",\"\",(IF(AA29=\"\",\"\",(PI()*((BP29/2)*(BP29/2)))/10000*AA29)))))))))))))","v":""}]
[null,null,null,null,null,null,null,null,null,null,null,null,null,null,null,null,null,null,null,null,null,"",null,{"$f":"IF(V30=\"\",\"\",(IF(BF30=\"N\",\"\",((V30*W30)/10000))))","v":""},null,null,null,{"$f":"IF(M30=\"\",0,(IF(T30=\"\",0,(IF(T30=\"Y\",0,(IF(S30=\"Y\",0, (IF(R30=\"Y\",0,(IF(BF30=\"N\",0,(IF(M30=\"P\",AA30)))))))))))))","v":0},{"$f":"IF(N30=\"\",0,(IF(T30=\"\",0,(IF(T30=\"Y\",0,(IF(S30=\"Y\",0, (IF(R30=\"Y\",0,(IF(BF30=\"N\",0,(IF(N30=\"P\",AA30)))))))))))))","v":0},{"$f":"IF(M30=\"\",0,(IF(T30=\"\",0,(IF(T30=\"N\",0,(IF(S30=\"Y\",0,(IF(BF30=\"N\",0,(IF(T30=\"Y\",(X30))))))))))))","v":0},{"$f":"IF(M30=\"\",0,(IF(T30=\"\",0,(IF(T30=\"Y\",0,(IF(S30=\"N\",0,(IF(BF30=\"N\",0,(IF(M30=\"P\",AA30)))))))))))","v":0},{"$f":"IF(N30=\"\",0,(IF(T30=\"\",0,(IF(T30=\"Y\",0,(IF(S30=\"N\",0, (IF(BF30=\"N\",0,(IF(N30=\"P\",AA30)))))))))))","v":0},{"$f":"IF(M30=\"\",0,(IF(T30=\"\",0,(IF(S30=\"N\",0,(IF(BF30=\"N\",0,(IF(T30=\"N\",0,(IF(T30=\"Y\",U30)))))))))))","v":0},{"$f":"IF(M30=\"\",0,(IF(T30=\"\",0,(IF(T30=\"Y\",0,(IF(S30=\"Y\",0,(IF(R30=\"N\",0,(IF(BF30=\"N\",0,(IF(M30=\"P\",AA30)))))))))))))","v":0},{"$f":"IF(N30=\"\",0,(IF(T30=\"\",0,(IF(T30=\"Y\",0,(IF(R30=\"N\",0, (IF(BF30=\"N\",0,(IF(N30=\"P\",AA30)))))))))))","v":0},{"$f":"IF(M30=\"\",0,(IF(BC30=\"N\",0,(IF(BD30=\"Y\",0,(IF(T30=\"Y\",0,(IF(BC30=\"E\",AA30,(IF(BC30=\"D\",AA30,(IF(BC30=\"O\",AA30,(IF(BC30=\"M\",AA30)))))))))))))))","v":0},{"$f":"IF(N30=\"\",0,(IF(BH30>0,0,(IF(BC30=\"N\",0,(IF(BD30=\"Y\",0,(IF(T30=\"Y\",0,(IF(BC30=\"E\",AA30,(IF(BC30=\"D\",AA30,(IF(BC30=\"O\",AA30,(IF(BC30=\"M\",AA30)))))))))))))))))","v":0},{"$f":"IF(M30=\"\",0,(IF(U30=\"\",0,(IF(BC30=\"N\",0,(IF(BD30=\"Y\",0,IF(T30=\"N\",0,(IF(BC30=\"E\",U30,(IF(BC30=\"D\",U30,(IF(BC30=\"O\",U30,(IF(BC30=\"M\",U30))))))))))))))))","v":0},{"$f":"(IF(M30=\"\",0,(IF(BE30=\"N\",0,(IF(BF30=\"Y\",0,(IF(BI30=0,0,(IF(BI30=\"\",\"\",(IF(Q30=\"Y\",0,(IF(R30=\"Y\",0,(IF(T30=\"Y\",0,(IF(BE30=\"Y\",AA30))))))))))))))))))","v":0},{"$f":"IF(N30=\"\",0,(IF(BE30=\"N\",0,(IF(BF30=\"Y\",0,(IF(BI30=0,0,(IF(BI30=\"\",0,(IF(Q30=\"Y\",0,(IF(R30=\"Y\",0,(IF(T30=\"Y\",0,(IF(BE30=\"Y\",AA30)))))))))))))))))","v":0},{"$f":"IF(M30=\"\",0,(IF(U30=\"\",0,(IF(T30=\"N\",0,(IF(BE30=\"N\",0,(IF(BF30=\"Y\",0,(IF(BE30=\"Y\",U30)))))))))))","v":0},{"$f":"(IF(M30=\"\",0,(IF(T30=\"Y\",0,(IF(S30=\"Y\",0,(IF(BD30=\"Y\",0,(IF(BE30=\"N\",0,(IF(BF30=\"Y\",0,(IF(BI30=0,0,(IF(BI30=\"\",\"\",(IF(R30=\"N\",0,(IF(R30=\"Y\",AA30))))))))))))))))))))+(IF(M30=\"\",0,(IF(R30=\"Y\",0,(IF(T30=\"Y\",0,(IF(S30=\"Y\",0,(IF(BD30=\"Y\",0,(IF(BE30=\"N\",0,(IF(BF30=\"Y\",0,(IF(BI30=0,0,(IF(BI30=\"\",\"\",(IF(Q30=\"Y\",AA30))))))))))))))))))))","v":0},{"$f":"(IF(N30=\"\",0,(IF(T30=\"\",0,(IF(T30=\"Y\",0,(IF(R30=\"N\",0, (IF(BF30=\"Y\",0,(IF(BE30=\"N\",0,(IF(BI30=0,0,(IF(BI30=\"\",\"\",(IF(R30=\"Y\",AA30))))))))))))))))))+(IF(N30=\"\",0,(IF(T30=\"\",0,(IF(T30=\"Y\",0,(IF(R30=\"Y\",0, (IF(BF30=\"Y\",0,(IF(BE30=\"N\",0,(IF(BI30=0,0,(IF(BI30=\"\",\"\",(IF(Q30=\"Y\",AA30))))))))))))))))))","v":0},{"$f":"(IF(M30=\"\",0,(IF(T30=\"Y\",0,(IF(BG30=\"Y\",0,(IF(BD30=\"N\",0,(IF(Q30=\"Y\",0,(IF(R30=\"Y\",0,(IF(BD30=\"Y\",AA30))))))))))))))","v":0},{"$f":"IF(N30=\"\",0,(IF(BD30=\"\",0,(IF(BD30=\"N\",0,(IF(BH30>0,0,(IF(T30=\"Y\",0,(IF(R30=\"Y\",0,(IF(Q30=\"Y\",0,(IF(BD30=\"Y\",AA30)))))))))))))))","v":0},{"$f":"IF(M30=\"\",0,(IF(BD30=\"\",0,(IF(BD30=\"N\",0,(IF(T30=\"N\",0,(IF(Q30=\"Y\",0,(IF(BD30=\"Y\",U30)))))))))))","v":0},{"$f":"(IF(M30=\"\",0,(IF(T30=\"\",0,(IF(T30=\"Y\",0,(IF(S30=\"Y\",0,(IF(R30=\"N\",0,(IF(BD30=\"N\",0,(IF(BE30=\"Y\",0,(IF(R30=\"Y\",AA30))))))))))))))))+(IF(R30=\"Y\",0,(IF(M30=\"\",0,(IF(BD30=\"N\",0,(IF(T30=\"\",0,(IF(T30=\"Y\",0,(IF(S30=\"Y\",0,(IF(BE30=\"Y\",0,(IF(Q30=\"Y\",AA30))))))))))))))))","v":0},{"$f":"(IF(N30=\"\",0,(IF(T30=\"\",0,(IF(T30=\"Y\",0,(IF(R30=\"N\",0,(IF(S30=\"Y\",0,(IF(BE30=\"Y\",0,(IF(BD30=\"N\",0,(IF(R30=\"Y\",AA30))))))))))))))))+(IF(R30=\"Y\",0,(IF(N30=\"\",0,(IF(T30=\"\",0,(IF(T30=\"Y\",0,(IF(S30=\"Y\",0,(IF(BE30=\"Y\",0,(IF(BD30=\"N\",0,(IF(Q30=\"Y\",AA30))))))))))))))))","v":0},{"$f":"IF(M30=\"\",0,(IF(BF30=\"Y\",0,(IF(BH30=\"\",0,(IF(BG30=\"N\",0,(IF(BH30=\"R\",0,(IF(BH30=\"S\",AA30)))))))))))","v":0},{"$f":"(IF(AW30=0,0,AW30))*3","v":0},{"$f":"IF(N30=\"\",0,(IF(BF30=\"Y\",0,(IF(BG30=\"N\",0,(IF(BH30=\"R\",0,(IF(BH30=\"S\",AA30)))))))))","v":0},{"$f":"IF(M30=\"\",0,(IF(BF30=\"Y\",0,(IF(BG30=\"N\",0,(IF(BH30=\"\",0,(IF(BH30=\"S\",0,(IF(BH30=\"R\",AA30)))))))))))","v":0},{"$f":"(IF(AZ30=0,0,AZ30))*2","v":0},{"$f":"IF(N30=\"\",0,(IF(BF30=\"Y\",0,(IF(BG30=\"N\",0,(IF(BH30=\"S\",0,(IF(BH30=\"R\",AA30)))))))))","v":0},null,null,null,null,null,null,null,null,null,null,null,null,null,null,null,null,{"$f":"IF(BK30=\"\",\"\",(BK30*12))","v":""},null,{"$f":"(IF(BT30=\"\",\"\",((BT30*50)^0.42)*0.64))","v":""},null,null,null,{"$f":"IF(BF30=\"\",\"\",(IF(BF30=\"N\",\"\",(IF(BF30=\"Y\",(IF(BN30=\"\",\"\",(IF($BN30<10,1,(IF($BN30<20,2,3))))*1.05)))))))","v":""},{"$f":"IF(BV30=\"\",\"\",(IF(BF30=\"N\",\"\",(IF(BF30=\"Y\",((100-$BV30)*0.04)+2)))))","v":""},null,{"$f":"IF(CA30=\"\",\"\",(IF(BF30=\"N\",\"\",(IF(BF30=\"Y\",(CA30*1.45))))))","v":""},null,{"$f":"IF(CC30=\"\",\"\",(IF(BF30=\"N\",\"\",(IF(BF30=\"Y\",(CC30*0.65))))))","v":""},null,{"$f":"IF(CE30=\"\",\"\",(IF(BF30=\"N\",\"\",(IF(BF30=\"Y\",(CE30*0.4))))))","v":""},null,{"$f":"IF(CG30=\"\",\"\",(IF(BF30=\"N\",\"\",(IF(BF30=\"Y\",(CG30*0.35))))))","v":""},{"$f":"IF(BY30=\"\",\"\",(SUM(BY30,BZ30,CB30,CD30,CF30,CH30)*SUM(BY30,BZ30,CB30,CD30,CF30,CH30)*SUM(BY30,BZ30,CB30,CD30,CF30,CH30)/55.5))","v":""},{"$f":"IF(CI30=\"\",\"\",IF(CI30<30,0,(IF(CI30>=30,1))))","v":""},{"$f":"IF(CI30=\"\",\"\",(IF(CJ30=1,CJ30=\"@\",(IF(CJ30=0,(IF($CI30<20,4*$CI30/550,(IF($CI30<30,6*$CI30/550,(IF($CI30<41,8*$CI30/550,(IF($CI30<61,10*$CI30/550,12*$CI30/550)))))))))))))","v":""},{"$f":"IF(CI30=\"\",\"\",((IF($CI30<20,4*$CI30/550,(IF($CI30<29.1,6*$CI30/550,(IF($CI30<40.1,8*$CI30/550,(IF($CI30<60.1,10*$CI30/550,12*$CI30/550))))))))*AA30))","v":""},{"$f":"IF(BF30=\"\",\"\",(IF(BF30=\"N\",\"\",(IF(T30=\"Y\",\"Y\",(IF(AA30=\"\",\"Y\",(IF(AA30=0,\"\",(IF(BF30=\"Y\",(AB30+AC30+AE30+AF30+AH30+AI30))))))))))))","v":""},{"$f":"IF(BG30=\"\",\"\",(IF(BG30=\"N\",\"\",(IF(BF30=\"Y\",\"\",(IF(Q30=\"Y\",\"\",(IF(BG30=\"Y\",(AW30+AY30+AZ30+BB30))))))))))","v":""},{"$f":"(IF(BF30=\"Y\",\"\",(IF(BG30=\"Y\",\"\",(IF(AL30>0,\"\",(IF(T30=\"Y\",\"Y\",(IF(AA30=\"\",\"\",(IF(AJ30>0,BI30,(IF(AK30>0,BI30,(AM30+AN30+AR30+AS30+AU30+AV30+AP30+AQ30)))))))))))))))","v":""},{"$f":"(IF(AA30=\"\",\"\",(IF(M30=\"\",\"\",(IF(Q30=\"Y\",\"\",(IF(BG30=\"N\",\"\",(IF(BF30=\"Y\",\"\",(IF(BG30=\"Y\",(AX30+BA30)))))))))))))","v":""},{"$f":"IF(AT30=0,\"\",(IF(AQ30=\"Y\",\"\",(AT30))))","v":""},{"$f":"IF(AA30=\"\",\"\",(IF(Q30=\"Y\",\"\",(IF(AR30=0,\"\",(AR30))))))","v":""},{"$f":"IF(AO30=0,\"\",(IF(Q30=\"Y\",\"\",(AO30*2))))","v":""},{"$f":"IF(AM30=0,\"\",(IF(Q30=\"Y\",\"\",(AM30*2))))","v":""},{"$f":"(IF(AE30=0,\"\",(IF(Q30=\"Y\",\"\",(AE30*2)))))","v":""},{"$f":"IF(AD30=0,\"\",(IF(Q30=\"Y\",\"\",(AD30))))","v":""},{"$f":"IF(BN30=\"\",\"\",(IF(S30=\"Y\",\"\",(IF(R30=\"Y\",\"\",(IF(Q30=\"Y\",\"\",(IF(T30=\"Y\",\"\",(IF(BF30=\"\",\"\",(IF(BF30=\"N\",\"\",(CL30))))))))))))))","v":""},{"$f":"IF(BF30=\"\",\"\",(IF(BF30=\"N\",\"\",(IF(BP30=\"\",\"\",(IF(R30=\"Y\",\"\",(IF(T30=\"Y\",\"\",(IF($CY$6=\"\",\"\",(IF(AA30=\"\",\"\",(PI()*((BP30/2)*(BP30/2)))/10000*AA30)))))))))))))","v":""}]
[null,null,null,null,null,null,null,null,null,null,null,null,null,null,null,null,null,null,null,null,null,"",null,"",null,null,null,0,0,0,0,0,0,0,0,0,0,0,0,0,0,0,0,0,0,0,0,0,0,0,0,0,0,0,null,null,null,null,null,null,null,null,null,null,null,null,null,null,null,null,"",null,"",null,null,null,"","",null,"",null,"",null,"",null,"","","","","","","","","","","","","","","","",""]
[null,null,null,null,null,null,null,null,null,null,null,null,null,null,null,null,null,null,null,null,null,"",null,"",null,null,null,0,0,0,0,0,0,0,0,0,0,0,0,0,0,0,0,0,0,0,0,0,0,0,0,0,0,0,null,null,null,null,null,null,null,null,null,null,null,null,null,null,null,null,"",null,"",null,null,null,"","",null,"",null,"",null,"",null,"","","","","","","","","","","","","","","","",""]
[null,null,null,null,null,null,null,null,null,null,null,null,null,null,null,null,null,null,null,null,null,"",null,"",null,null,null,0,0,0,0,0,0,0,0,0,0,0,0,0,0,0,0,0,0,0,0,0,0,0,0,0,0,0,null,null,null,null,null,null,null,null,null,null,null,null,null,null,null,null,"",null,"",null,null,null,"","",null,"",null,"",null,"",null,"","","","","","","","","","","","","","","","",""]
[null,null,null,null,null,null,null,null,null,null,null,null,null,null,null,null,null,null,null,null,null,"",null,"",null,null,null,0,0,0,0,0,0,0,0,0,0,0,0,0,0,0,0,0,0,0,0,0,0,0,0,0,0,0,null,null,null,null,null,null,null,null,null,null,null,null,null,null,null,null,"",null,"",null,null,null,"","",null,"",null,"",null,"",null,"","","","","","","","","","","","","","","","",""]
[null,null,null,null,null,null,null,null,null,null,null,null,null,null,null,null,null,null,null,null,null,"",null,"",null,null,null,0,0,0,0,0,0,0,0,0,0,0,0,0,0,0,0,0,0,0,0,0,0,0,0,0,0,0,null,null,null,null,null,null,null,null,null,null,null,null,null,null,null,null,"",null,"",null,null,null,"","",null,"",null,"",null,"",null,"","","","","","","","","","","","","","","","",""]
[null,null,null,null,null,null,null,null,null,null,null,null,null,null,null,null,null,null,null,null,null,"",null,"",null,null,null,0,0,0,0,0,0,0,0,0,0,0,0,0,0,0,0,0,0,0,0,0,0,0,0,0,0,0,null,null,null,null,null,null,null,null,null,null,null,null,null,null,null,null,"",null,"",null,null,null,"","",null,"",null,"",null,"",null,"","","","","","","","","","","","","","","","",""]
[null,null,null,null,null,null,null,null,null,null,null,null,null,null,null,null,null,null,null,null,null,"",null,"",null,null,null,0,0,0,0,0,0,0,0,0,0,0,0,0,0,0,0,0,0,0,0,0,0,0,0,0,0,0,null,null,null,null,null,null,null,null,null,null,null,null,null,null,null,null,"",null,"",null,null,null,"","",null,"",null,"",null,"",null,"","","","","","","","","","","","","","","","",""]
[null,null,null,null,null,null,null,null,null,null,null,null,null,null,null,null,null,null,null,null,null,"",null,"",null,null,null,0,0,0,0,0,0,0,0,0,0,0,0,0,0,0,0,0,0,0,0,0,0,0,0,0,0,0,null,null,null,null,null,null,null,null,null,null,null,null,null,null,null,null,"",null,"",null,null,null,"","",null,"",null,"",null,"",null,"","","","","","","","","","","","","","","","",""]
[null,null,null,null,null,null,null,null,null,null,null,null,null,null,null,null,null,null,null,null,null,"",null,"",null,null,null,0,0,0,0,0,0,0,0,0,0,0,0,0,0,0,0,0,0,0,0,0,0,0,0,0,0,0,null,null,null,null,null,null,null,null,null,null,null,null,null,null,null,null,"",null,"",null,null,null,"","",null,"",null,"",null,"",null,"","","","","","","","","","","","","","","","",""]
[null,null,null,null,null,null,null,null,null,null,null,null,null,null,null,null,null,null,null,null,null,"",null,"",null,null,null,0,0,0,0,0,0,0,0,0,0,0,0,0,0,0,0,0,0,0,0,0,0,0,0,0,0,0,null,null,null,null,null,null,null,null,null,null,null,null,null,null,null,null,"",null,"",null,null,null,"","",null,"",null,"",null,"",null,"","","","","","","","","","","","","","","","",""]
[null,null,null,null,null,null,null,null,null,null,null,null,null,null,null,null,null,null,null,null,null,"",null,"",null,null,null,0,0,0,0,0,0,0,0,0,0,0,0,0,0,0,0,0,0,0,0,0,0,0,0,0,0,0,null,null,null,null,null,null,null,null,null,null,null,null,null,null,null,null,"",null,"",null,null,null,"","",null,"",null,"",null,"",null,"","","","","","","","","","","","","","","","",""]
[null,null,null,null,null,null,null,null,null,null,null,null,null,null,null,null,null,null,null,null,null,"",null,"",null,null,null,0,0,0,0,0,0,0,0,0,0,0,0,0,0,0,0,0,0,0,0,0,0,0,0,0,0,0,null,null,null,null,null,null,null,null,null,null,null,null,null,null,null,null,"",null,"",null,null,null,"","",null,"",null,"",null,"",null,"","","","","","","","","","","","","","","","",""]
[null,null,null,null,null,null,null,null,null,null,null,null,null,null,null,null,null,null,null,null,null,"",null,"",null,null,null,0,0,0,0,0,0,0,0,0,0,0,0,0,0,0,0,0,0,0,0,0,0,0,0,0,0,0,null,null,null,null,null,null,null,null,null,null,null,null,null,null,null,null,"",null,"",null,null,null,"","",null,"",null,"",null,"",null,"","","","","","","","","","","","","","","","",""]
[null,null,null,null,null,null,null,null,null,null,null,null,null,null,null,null,null,null,null,null,null,"",null,"",null,null,null,0,0,0,0,0,0,0,0,0,0,0,0,0,0,0,0,0,0,0,0,0,0,0,0,0,0,0,null,null,null,null,null,null,null,null,null,null,null,null,null,null,null,null,"",null,"",null,null,null,"","",null,"",null,"",null,"",null,"","","","","","","","","","","","","","","","",""]
[null,null,null,null,null,null,null,null,null,null,null,null,null,null,null,null,null,null,null,null,null,"",null,"",null,null,null,0,0,0,0,0,0,0,0,0,0,0,0,0,0,0,0,0,0,0,0,0,0,0,0,0,0,0,null,null,null,null,null,null,null,null,null,null,null,null,null,null,null,null,"",null,"",null,null,null,"","",null,"",null,"",null,"",null,"","","","","","","","","","","","","","","","",""]
[null,null,null,null,null,null,null,null,null,null,null,null,null,null,null,null,null,null,null,null,null,"",null,"",null,null,null,0,0,0,0,0,0,0,0,0,0,0,0,0,0,0,0,0,0,0,0,0,0,0,0,0,0,0,null,null,null,null,null,null,null,null,null,null,null,null,null,null,null,null,"",null,"",null,null,null,"","",null,"",null,"",null,"",null,"","","","","","","","","","","","","","","","",""]
[null,null,null,null,null,null,null,null,null,null,null,null,null,null,null,null,null,null,null,null,null,"",null,"",null,null,null,0,0,0,0,0,0,0,0,0,0,0,0,0,0,0,0,0,0,0,0,0,0,0,0,0,0,0,null,null,null,null,null,null,null,null,null,null,null,null,null,null,null,null,"",null,"",null,null,null,"","",null,"",null,"",null,"",null,"","","","","","","","","","","","","","","","",""]
[null,null,null,null,null,null,null,null,null,null,null,null,null,null,null,null,null,null,null,null,null,"",null,{"$f":"IF(V48=\"\",\"\",(IF(BF48=\"N\",\"\",((V48*W48)/10000))))","v":""},null,null,null,0,0,0,0,0,0,0,0,0,0,0,0,0,0,0,0,0,0,0,0,0,0,0,0,0,0,0,null,null,null,null,null,null,null,null,null,null,null,null,null,null,null,null,"",null,"",null,null,null,"","",null,"",null,"",null,"",null,"","","","",{"$f":"IF(CI48=\"\",\"\",((IF($CI48<20,4*$CI48/550,(IF($CI48<29.1,6*$CI48/550,(IF($CI48<40.1,8*$CI48/550,(IF($CI48<60.1,10*$CI48/550,12*$CI48/550))))))))*AA48))","v":""},{"$f":"IF(BF48=\"\",\"\",(IF(BF48=\"N\",\"\",(IF(T48=\"Y\",\"Y\",(IF(AA48=\"\",\"Y\",(IF(AA48=0,\"\",(IF(BF48=\"Y\",(AB48+AC48+AE48+AF48+AH48+AI48))))))))))))","v":""},{"$f":"IF(BG48=\"\",\"\",(IF(BG48=\"N\",\"\",(IF(BF48=\"Y\",\"\",(IF(Q48=\"Y\",\"\",(IF(BG48=\"Y\",(AW48+AY48+AZ48+BB48))))))))))","v":""},{"$f":"(IF(BF48=\"Y\",\"\",(IF(BG48=\"Y\",\"\",(IF(AL48>0,\"\",(IF(T48=\"Y\",\"Y\",(IF(AA48=\"\",\"\",(IF(AJ48>0,BI48,(IF(AK48>0,BI48,(AM48+AN48+AR48+AS48+AU48+AV48+AP48+AQ48)))))))))))))))","v":""},{"$f":"(IF(AA48=\"\",\"\",(IF(M48=\"\",\"\",(IF(Q48=\"Y\",\"\",(IF(BG48=\"N\",\"\",(IF(BF48=\"Y\",\"\",(IF(BG48=\"Y\",(AX48+BA48)))))))))))))","v":""},"",{"$f":"IF(AA48=\"\",\"\",(IF(Q48=\"Y\",\"\",(IF(AR48=0,\"\",(AR48))))))","v":""},{"$f":"IF(AO48=0,\"\",(IF(Q48=\"Y\",\"\",(AO48*2))))","v":""},{"$f":"IF(AM48=0,\"\",(IF(Q48=\"Y\",\"\",(AM48*2))))","v":""},"","",{"$f":"IF(BN48=\"\",\"\",(IF(S48=\"Y\",\"\",(IF(R48=\"Y\",\"\",(IF(Q48=\"Y\",\"\",(IF(T48=\"Y\",\"\",(IF(BF48=\"\",\"\",(IF(BF48=\"N\",\"\",(CL48))))))))))))))","v":""},{"$f":"IF(BF48=\"\",\"\",(IF(BF48=\"N\",\"\",(IF(BP48=\"\",\"\",(IF(R48=\"Y\",\"\",(IF(T48=\"Y\",\"\",(IF($CY$6=\"\",\"\",(IF(AA48=\"\",\"\",(PI()*((BP48/2)*(BP48/2)))/10000*AA48)))))))))))))","v":""}]
[null,null,null,null,null,null,null,null,null,null,null,null,null,null,null,null,null,null,null,null,null,"",null,{"$f":"IF(V49=\"\",\"\",(IF(BF49=\"N\",\"\",((V49*W49)/10000))))","v":""},null,null,null,0,0,0,0,0,0,0,0,0,0,0,0,0,0,0,0,0,0,0,0,0,0,0,0,0,0,0,null,null,null,null,null,null,null,null,null,null,null,null,null,null,null,null,"",null,"",null,null,null,"","",null,"",null,"",null,"",null,"","","","",{"$f":"IF(CI49=\"\",\"\",((IF($CI49<20,4*$CI49/550,(IF($CI49<29.1,6*$CI49/550,(IF($CI49<40.1,8*$CI49/550,(IF($CI49<60.1,10*$CI49/550,12*$CI49/550))))))))*AA49))","v":""},{"$f":"IF(BF49=\"\",\"\",(IF(BF49=\"N\",\"\",(IF(T49=\"Y\",\"Y\",(IF(AA49=\"\",\"Y\",(IF(AA49=0,\"\",(IF(BF49=\"Y\",(AB49+AC49+AE49+AF49+AH49+AI49))))))))))))","v":""},{"$f":"IF(BG49=\"\",\"\",(IF(BG49=\"N\",\"\",(IF(BF49=\"Y\",\"\",(IF(Q49=\"Y\",\"\",(IF(BG49=\"Y\",(AW49+AY49+AZ49+BB49))))))))))","v":""},{"$f":"(IF(BF49=\"Y\",\"\",(IF(BG49=\"Y\",\"\",(IF(AL49>0,\"\",(IF(T49=\"Y\",\"Y\",(IF(AA49=\"\",\"\",(IF(AJ49>0,BI49,(IF(AK49>0,BI49,(AM49+AN49+AR49+AS49+AU49+AV49+AP49+AQ49)))))))))))))))","v":""},{"$f":"(IF(AA49=\"\",\"\",(IF(M49=\"\",\"\",(IF(Q49=\"Y\",\"\",(IF(BG49=\"N\",\"\",(IF(BF49=\"Y\",\"\",(IF(BG49=\"Y\",(AX49+BA49)))))))))))))","v":""},"",{"$f":"IF(AA49=\"\",\"\",(IF(Q49=\"Y\",\"\",(IF(AR49=0,\"\",(AR49))))))","v":""},{"$f":"IF(AO49=0,\"\",(IF(Q49=\"Y\",\"\",(AO49*2))))","v":""},{"$f":"IF(AM49=0,\"\",(IF(Q49=\"Y\",\"\",(AM49*2))))","v":""},"","",{"$f":"IF(BN49=\"\",\"\",(IF(S49=\"Y\",\"\",(IF(R49=\"Y\",\"\",(IF(Q49=\"Y\",\"\",(IF(T49=\"Y\",\"\",(IF(BF49=\"\",\"\",(IF(BF49=\"N\",\"\",(CL49))))))))))))))","v":""},{"$f":"IF(BF49=\"\",\"\",(IF(BF49=\"N\",\"\",(IF(BP49=\"\",\"\",(IF(R49=\"Y\",\"\",(IF(T49=\"Y\",\"\",(IF($CY$6=\"\",\"\",(IF(AA49=\"\",\"\",(PI()*((BP49/2)*(BP49/2)))/10000*AA49)))))))))))))","v":""}]
[null,null,null,null,null,null,null,null,null,null,null,null,null,null,null,null,null,null,null,null,null,"",null,{"$f":"IF(V50=\"\",\"\",(IF(BF50=\"N\",\"\",((V50*W50)/10000))))","v":""},null,null,null,0,0,0,0,0,0,0,0,0,0,0,0,0,0,0,0,0,0,0,0,0,0,0,0,0,0,0,null,null,null,null,null,null,null,null,null,null,null,null,null,null,null,null,"",null,"",null,null,null,{"$f":"IF(BF50=\"\",\"\",(IF(BF50=\"N\",\"\",(IF(BF50=\"Y\",(IF(BN50=\"\",\"\",(IF($BN50<10,1,(IF($BN50<20,2,3))))*1.05)))))))","v":""},"",null,"",null,"",null,"",null,"","","","",{"$f":"IF(CI50=\"\",\"\",((IF($CI50<20,4*$CI50/550,(IF($CI50<29.1,6*$CI50/550,(IF($CI50<40.1,8*$CI50/550,(IF($CI50<60.1,10*$CI50/550,12*$CI50/550))))))))*AA50))","v":""},{"$f":"IF(BF50=\"\",\"\",(IF(BF50=\"N\",\"\",(IF(T50=\"Y\",\"Y\",(IF(AA50=\"\",\"Y\",(IF(AA50=0,\"\",(IF(BF50=\"Y\",(AB50+AC50+AE50+AF50+AH50+AI50))))))))))))","v":""},{"$f":"IF(BG50=\"\",\"\",(IF(BG50=\"N\",\"\",(IF(BF50=\"Y\",\"\",(IF(Q50=\"Y\",\"\",(IF(BG50=\"Y\",(AW50+AY50+AZ50+BB50))))))))))","v":""},{"$f":"(IF(BF50=\"Y\",\"\",(IF(BG50=\"Y\",\"\",(IF(AL50>0,\"\",(IF(T50=\"Y\",\"Y\",(IF(AA50=\"\",\"\",(IF(AJ50>0,BI50,(IF(AK50>0,BI50,(AM50+AN50+AR50+AS50+AU50+AV50+AP50+AQ50)))))))))))))))","v":""},{"$f":"(IF(AA50=\"\",\"\",(IF(M50=\"\",\"\",(IF(Q50=\"Y\",\"\",(IF(BG50=\"N\",\"\",(IF(BF50=\"Y\",\"\",(IF(BG50=\"Y\",(AX50+BA50)))))))))))))","v":""},"",{"$f":"IF(AA50=\"\",\"\",(IF(Q50=\"Y\",\"\",(IF(AR50=0,\"\",(AR50))))))","v":""},{"$f":"IF(AO50=0,\"\",(IF(Q50=\"Y\",\"\",(AO50*2))))","v":""},{"$f":"IF(AM50=0,\"\",(IF(Q50=\"Y\",\"\",(AM50*2))))","v":""},"","",{"$f":"IF(BN50=\"\",\"\",(IF(S50=\"Y\",\"\",(IF(R50=\"Y\",\"\",(IF(Q50=\"Y\",\"\",(IF(T50=\"Y\",\"\",(IF(BF50=\"\",\"\",(IF(BF50=\"N\",\"\",(CL50))))))))))))))","v":""},{"$f":"IF(BF50=\"\",\"\",(IF(BF50=\"N\",\"\",(IF(BP50=\"\",\"\",(IF(R50=\"Y\",\"\",(IF(T50=\"Y\",\"\",(IF($CY$6=\"\",\"\",(IF(AA50=\"\",\"\",(PI()*((BP50/2)*(BP50/2)))/10000*AA50)))))))))))))","v":""}]
[null,null,null,null,null,null,null,null,null,null,null,null,null,null,null,null,null,null,null,null,null,"",null,{"$f":"IF(V51=\"\",\"\",(IF(BF51=\"N\",\"\",((V51*W51)/10000))))","v":""},null,null,null,0,0,0,0,0,0,0,0,0,0,0,0,0,0,0,0,0,0,0,0,0,0,0,0,0,0,0,null,null,null,null,null,null,null,null,null,null,null,null,null,null,null,null,"",null,"",null,null,null,"","",null,"",null,"",null,"",null,"","","","",{"$f":"IF(CI51=\"\",\"\",((IF($CI51<20,4*$CI51/550,(IF($CI51<29.1,6*$CI51/550,(IF($CI51<40.1,8*$CI51/550,(IF($CI51<60.1,10*$CI51/550,12*$CI51/550))))))))*AA51))","v":""},{"$f":"IF(BF51=\"\",\"\",(IF(BF51=\"N\",\"\",(IF(T51=\"Y\",\"Y\",(IF(AA51=\"\",\"Y\",(IF(AA51=0,\"\",(IF(BF51=\"Y\",(AB51+AC51+AE51+AF51+AH51+AI51))))))))))))","v":""},{"$f":"IF(BG51=\"\",\"\",(IF(BG51=\"N\",\"\",(IF(BF51=\"Y\",\"\",(IF(Q51=\"Y\",\"\",(IF(BG51=\"Y\",(AW51+AY51+AZ51+BB51))))))))))","v":""},{"$f":"(IF(BF51=\"Y\",\"\",(IF(BG51=\"Y\",\"\",(IF(AL51>0,\"\",(IF(T51=\"Y\",\"Y\",(IF(AA51=\"\",\"\",(IF(AJ51>0,BI51,(IF(AK51>0,BI51,(AM51+AN51+AR51+AS51+AU51+AV51+AP51+AQ51)))))))))))))))","v":""},{"$f":"(IF(AA51=\"\",\"\",(IF(M51=\"\",\"\",(IF(Q51=\"Y\",\"\",(IF(BG51=\"N\",\"\",(IF(BF51=\"Y\",\"\",(IF(BG51=\"Y\",(AX51+BA51)))))))))))))","v":""},"",{"$f":"IF(AA51=\"\",\"\",(IF(Q51=\"Y\",\"\",(IF(AR51=0,\"\",(AR51))))))","v":""},{"$f":"IF(AO51=0,\"\",(IF(Q51=\"Y\",\"\",(AO51*2))))","v":""},{"$f":"IF(AM51=0,\"\",(IF(Q51=\"Y\",\"\",(AM51*2))))","v":""},"","",{"$f":"IF(BN51=\"\",\"\",(IF(S51=\"Y\",\"\",(IF(R51=\"Y\",\"\",(IF(Q51=\"Y\",\"\",(IF(T51=\"Y\",\"\",(IF(BF51=\"\",\"\",(IF(BF51=\"N\",\"\",(CL51))))))))))))))","v":""},{"$f":"IF(BF51=\"\",\"\",(IF(BF51=\"N\",\"\",(IF(BP51=\"\",\"\",(IF(R51=\"Y\",\"\",(IF(T51=\"Y\",\"\",(IF($CY$6=\"\",\"\",(IF(AA51=\"\",\"\",(PI()*((BP51/2)*(BP51/2)))/10000*AA51)))))))))))))","v":""}]
["xxxx",null,null,null,null,null,null,null,null,null,null,null,null,null,null,null,null,null,null,null,null,"",null,{"$f":"IF(V52=\"\",\"\",(IF(BF52=\"N\",\"\",((V52*W52)/10000))))","v":""},null,null,null,0,0,0,0,0,0,0,0,0,0,0,0,0,0,0,0,0,0,0,0,0,0,0,0,0,0,0,null,null,null,null,null,null,null,null,null,null,null,null,null,null,null,null,"",null,"",null,null,null,"","",null,"",null,"",null,"",null,"","","","",{"$f":"IF(CI52=\"\",\"\",((IF($CI52<20,4*$CI52/550,(IF($CI52<29.1,6*$CI52/550,(IF($CI52<40.1,8*$CI52/550,(IF($CI52<60.1,10*$CI52/550,12*$CI52/550))))))))*AA52))","v":""},{"$f":"IF(BF52=\"\",\"\",(IF(BF52=\"N\",\"\",(IF(T52=\"Y\",\"Y\",(IF(AA52=\"\",\"Y\",(IF(AA52=0,\"\",(IF(BF52=\"Y\",(AB52+AC52+AE52+AF52+AH52+AI52))))))))))))","v":""},{"$f":"IF(BG52=\"\",\"\",(IF(BG52=\"N\",\"\",(IF(BF52=\"Y\",\"\",(IF(Q52=\"Y\",\"\",(IF(BG52=\"Y\",(AW52+AY52+AZ52+BB52))))))))))","v":""},{"$f":"(IF(BF52=\"Y\",\"\",(IF(BG52=\"Y\",\"\",(IF(AL52>0,\"\",(IF(T52=\"Y\",\"Y\",(IF(AA52=\"\",\"\",(IF(AJ52>0,BI52,(IF(AK52>0,BI52,(AM52+AN52+AR52+AS52+AU52+AV52+AP52+AQ52)))))))))))))))","v":""},{"$f":"(IF(AA52=\"\",\"\",(IF(M52=\"\",\"\",(IF(Q52=\"Y\",\"\",(IF(BG52=\"N\",\"\",(IF(BF52=\"Y\",\"\",(IF(BG52=\"Y\",(AX52+BA52)))))))))))))","v":""},"",{"$f":"IF(AA52=\"\",\"\",(IF(Q52=\"Y\",\"\",(IF(AR52=0,\"\",(AR52))))))","v":""},{"$f":"IF(AO52=0,\"\",(IF(Q52=\"Y\",\"\",(AO52*2))))","v":""},{"$f":"IF(AM52=0,\"\",(IF(Q52=\"Y\",\"\",(AM52*2))))","v":""},"","",{"$f":"IF(BN52=\"\",\"\",(IF(S52=\"Y\",\"\",(IF(R52=\"Y\",\"\",(IF(Q52=\"Y\",\"\",(IF(T52=\"Y\",\"\",(IF(BF52=\"\",\"\",(IF(BF52=\"N\",\"\",(CL52))))))))))))))","v":""},{"$f":"IF(BF52=\"\",\"\",(IF(BF52=\"N\",\"\",(IF(BP52=\"\",\"\",(IF(R52=\"Y\",\"\",(IF(T52=\"Y\",\"\",(IF($CY$6=\"\",\"\",(IF(AA52=\"\",\"\",(PI()*((BP52/2)*(BP52/2)))/10000*AA52)))))))))))))","v":""}]

{"sheet":"species","index":2,"n_rows":171,"n_cols":110,"rows_kept":171,"cut":false,"hidden":false,"merged":[[0,4,10,4],[11,4,13,4],[2,76,15,76],[2,77,15,77],[2,78,15,78],[2,79,15,79],[2,80,15,80],[2,81,15,81],[2,82,15,82],[1,6,14,6],[1,7,14,7],[1,8,14,8],[2,26,3,26],[5,24,6,24],[2,16,13,16],[2,17,13,17],[0,12,8,15],[9,12,14,12],[9,13,14,13],[9,15,14,15],[0,16,1,16],[0,17,1,17],[1,9,14,9],[1,10,14,10],[1,11,14,11],[0,18,1,18],[2,18,13,18],[9,14,14,14],[0,19,1,19],[2,19,13,19],[6,20,14,20],[8,24,13,24],[166,101,166,102],[133,101,133,102],[134,101,134,102],[138,101,138,102],[139,101,139,102],[140,101,140,102],[123,101,123,102],[124,101,124,102],[125,101,125,102],[126,101,126,102],[127,101,127,102],[128,101,128,102],[129,101,129,102],[130,101,130,102],[131,101,131,102],[137,101,137,102],[167,101,167,102],[168,101,168,102],[169,101,169,102],[162,101,162,102],[0,52,13,52],[0,20,1,20],[3,20,4,20],[0,27,13,27],[0,45,13,45],[5,23,13,23],[2,24,3,24],[2,25,3,25],[5,25,6,25],[0,43,13,43],[164,101,164,102],[165,101,165,102],[158,101,158,102],[159,101,159,102],[160,101,160,102],[161,101,161,102],[135,101,135,102],[136,101,136,102],[2,89,15,89],[132,101,132,102],[0,109,13,109],[0,21,13,21],[170,101,170,102],[150,101,150,102],[151,101,151,102],[152,101,152,102],[153,101,153,102],[154,101,154,102],[155,101,155,102],[156,101,156,102],[157,101,157,102],[163,101,163,102],[141,101,141,102],[142,101,142,102],[143,101,143,102],[144,101,144,102],[145,101,145,102],[146,101,146,102],[147,101,147,102],[148,101,148,102],[121,101,121,102],[122,101,122,102],[149,101,149,102],[8,25,13,25],[112,101,112,102],[113,101,113,102],[114,101,114,102],[115,101,115,102],[116,101,116,102],[117,101,117,102],[118,101,118,102],[119,101,119,102],[120,101,120,102],[103,101,103,102],[104,101,104,102],[105,101,105,102],[106,101,106,102],[107,101,107,102],[108,101,108,102],[109,101,109,102],[110,101,110,102],[111,101,111,102],[94,101,94,102],[95,101,95,102],[96,101,96,102],[97,101,97,102],[98,101,98,102],[99,101,99,102],[100,101,100,102],[101,101,101,102],[102,101,102,102],[85,101,85,102],[86,101,86,102],[87,101,87,102],[88,101,88,102],[89,101,89,102],[90,101,90,102],[91,101,91,102],[92,101,92,102],[93,101,93,102],[76,101,76,102],[77,101,77,102],[78,101,78,102],[79,101,79,102],[80,101,80,102],[81,101,81,102],[82,101,82,102],[83,101,83,102],[84,101,84,102],[67,101,67,102],[68,101,68,102],[69,101,69,102],[70,101,70,102],[71,101,71,102],[72,101,72,102],[73,101,73,102],[74,101,74,102],[75,101,75,102],[58,101,58,102],[59,101,59,102],[60,101,60,102],[61,101,61,102],[62,101,62,102],[63,101,63,102],[64,101,64,102],[65,101,65,102],[66,101,66,102],[49,101,49,102],[50,101,50,102],[51,101,51,102],[52,101,52,102],[53,101,53,102],[54,101,54,102],[55,101,55,102],[56,101,56,102],[57,101,57,102],[40,101,40,102],[41,101,41,102],[42,101,42,102],[43,101,43,102],[44,101,44,102],[45,101,45,102],[46,101,46,102],[47,101,47,102],[48,101,48,102],[31,101,31,102],[32,101,32,102],[33,101,33,102],[34,101,34,102],[35,101,35,102],[36,101,36,102],[37,101,37,102],[38,101,38,102],[39,101,39,102],[22,101,22,102],[23,101,23,102],[24,101,24,102],[25,101,25,102],[26,101,26,102],[27,101,27,102],[28,101,28,102],[29,101,29,102],[30,101,30,102],[15,101,15,102],[16,101,16,102],[17,101,17,102],[18,101,18,102],[19,101,19,102],[20,101,20,102],[21,101,21,102],[3,97,14,97],[3,98,14,98],[3,99,14,99],[3,100,6,100],[1,101,2,102],[2,90,14,90],[2,91,14,91],[2,92,14,92],[3,101,4,102],[5,101,7,101],[5,102,7,102],[7,100,8,100],[8,101,9,101],[8,102,9,102],[9,100,14,100],[10,101,11,101],[10,102,11,102],[12,101,13,102],[14,101,14,102],[1,90,1,92],[1,93,1,100],[2,94,2,95],[2,96,2,97],[2,98,2,100],[3,93,14,93],[3,94,14,94],[3,95,14,95],[3,96,14,96],[0,86,1,89],[1,73,13,73],[11,88,12,88],[5,69,13,69],[0,68,13,68],[2,88,10,88],[0,42,13,42],[0,46,13,46],[1,74,13,74],[1,75,13,75],[0,61,13,61],[1,56,4,56],[0,71,13,71],[0,72,13,72],[2,85,15,85],[2,86,15,86],[2,87,15,87],[13,88,15,88],[2,83,15,83],[2,84,15,84],[8,26,13,26],[0,22,13,22],[0,23,2,23],[0,24,1,26],[1,54,13,54],[3,23,4,23],[5,26,6,26],[0,49,13,49],[0,40,13,40],[0,44,13,44],[0,37,13,37],[0,38,13,38],[0,39,13,39],[0,50,13,50],[0,48,13,48],[0,47,13,47],[0,51,13,51],[0,53,13,53],[0,35,13,35],[0,36,13,36],[0,28,13,28],[0,29,13,29],[0,33,13,33],[0,30,13,30],[0,31,13,31],[0,32,13,32],[0,70,13,70],[1,55,4,55],[0,60,2,60],[5,58,13,58],[3,60,4,60],[0,62,13,62],[5,57,13,57],[5,60,13,60],[1,57,4,57],[1,58,4,58],[1,59,13,59],[0,63,13,63],[5,55,13,55],[5,56,13,56],[0,41,13,41],[0,34,13,34],[0,66,13,66],[0,64,13,64],[0,65,13,65],[0,67,13,67],[0,69,4,69]]}
[null,null,null,null,"Plants highlighted in \"Yellow\" below are those which have a rating of Rare, Vulnerable or Endangerd, National Parks & Wildlife Act, 1972; Regulations - Scedules 7, 8 & 9.  A 20% loading has been added to the SEB offset calculation for these plants as per advice from Native Vegetation Group. \nTo check current lists use link below.",null,null,null,null,null,null,null,"IMPACT OR RECOMMENDED ACTION (for trees & shrubs)",null,null,null,"Y\nN","Y\nN","Y\nN","Y\nN","TOTAL NVA AREA (HA)","AREA TO BE REMOVED SUBJECT TO THE NVA","NVA SEB Multipliation Factor (Condition)",{"$f":"SUM($X$17:$X$5002)","v":0},"TOTAL NUMBER OF INDIVIDUALS SURVEYED (REFER COLUMNS TO RIGHT)",null,null,"STANDARD CLEARANCE\nREMOVAL \nNumber of Native Veg","STANDARD CLEARANCE\nMAJOR PRUNE\nNumber of Native Veg","Area of Native Veg","Regulation 5(1)(lb)\nREMOVAL \nNumber of Native Veg","Regulation 5(1)(lb)\nMAJOR PRUNE\nNumber of Native Veg","Regulation 5(1)(lb)\nArea of Native Veg","STRUCTURALLY UNSOUND\nREMOVAL \nNumber of Native Veg","STRUCTURALLY UNSOUND\nMAJOR PRUNE\nNumber of Native Veg","REMOVAL\nNumber of weeds and \"others\" excluding amenity planting","MAJOR PRUNE\nNumber of weeds and \"others\" excluding amenity planting","AREA OF WEEDS EXCLUDING AMENITY","REMOVAL\nNumber - Native Vegetation Not covered by ACT","MAJOR PRUNE\nNumber - Native Vegetation Not covered by ACT","Area - Native Vegetation Not covered by ACT","STRUCTURALLY UNSOUND\nREMOVAL \nNumber - Native Vegetation Not covered by ACT","STRUCTURALLY UNSOUND\nMAJOR PRUNE\nNumber - Native Vegetation Not covered by ACT","STANDARD CLEARANCE\nREMOVAL\nNumber - Amenity Planting","STANDARD CLEARANCE\nMAJOR PRUNE\nNumber - Amenity Planting","Area - Amenity Planting","STRUCTURALLY UNSOUND\nREMOVAL \nNumber - Amenity Planting","STRUCTURALLY UNSOUND\nMAJOR PRUNE\nNumber - Amenity Planting","REMOVAL\nNumber - Regulated Significant Trees","SEB\nNumber - Regulated Significant Trees","MAJOR PRUNE\nNumber - Regulated Significant Trees","REMOVAL\nNumber - Regulated Trees","SEB\nNumber - Regulated Trees","MAJOR PRUNE\nNumber - Regulated Trees",6,"B","C","D","E","F",{"$f":"SUM(BI16:BI4999)","v":0},"SINGLE-STEMMED(S) OR  MULTI-STEMMED(MS) SPECIMEN","BUTT DIA (M). IN GROUP AND/OR MS SITUATIONS INSERT HIGHEST RANGE READING","BUTT DIA (M). ONLY USE THIS COLUMN IN A GROUP AND/OR MS SITUATION INSERT LOWEST  RANGE","CIRCUMFERENCE (M) DEVELOPMENT ACT REQUIREMENT ONLY","HEIGHT (m) - In GROUP situations insert HIGHEST range reading.","HEIGHT (m) - In GROUP situations insert LOWEST range reading.","SPREAD (m) - In GROUP situations insert WIDEST range reading.","SPREAD (m) - In GROUP situations insert NARROWEST range reading.","VG\nG\nF\nP\nD","APPROXIMATE TREE PROTECTION ZONE (TPZ) - BUTT DIA. @ 1.0m x 12","TRUNK DIA. JUST ABOVE TREE BASE (m)","STRUCTURAL ROOT ZONE (SRZ) RADIUS (m)","NVA INFORMATION",null,null,null,null,null,null,null,null,null,null,null,null,null,null,null,null,null,null,null,null,null,null,null,null,null,null,null,null,null,null,null,null,null,null,null,"Comments"]
[null,null,null,null,null,null,"CLEARANCE ENVELOPE (S - STANDARD, R - RESTRICTED)","SIDE OF ROAD (L - LEFT, R - RIGHT)","Width of the Travelway","Distance - Centreline to Edgeline","Distance of Tree from the Edgeline\n(Shown in RED if behind Guardrailing)","Clearance @ Edgeline OR Edge of Envelope",null,null,null,null,null,null,null,null,null,null,null,null,null,null,null,null,null,null,null,null,null,null,null,null,null,null,null,null,null,null,null,null,null,null,null,null,null,null,null,null,null,null,"WEED SPECIES (N-no; D-declared; E-environmental)","Y\nN","Y\nN","Y\nN","Y\nN","REGULATED (R) OR REGULATED SIGNIFICANT TREES (S)",null,null,null,null,null,null,null,null,null,null,null,null,null,"%  DIEBACK","HOLLOWS (NUMBER)","HOLLOW ENTRANCE SIZE (METRES)",null,null,null,null,null,null,null,null,"VALUE",null,null,null,null,null,"APPROVALS",null,null,"SET ASIDE",null,null,null,null,null,null,null,"PAYMENT INTO THE FUND FOR SCATTERED TREES"]
[null,null,null,null,null,null,null,null,null,null,null,null,null,null,null,null,"SEB NEGATED","STRUCTURALLY UNSOUND TREE","REGULATION 5(1)(lb) APPLIES","Area reporting selected in lieu of individual reporting",{"$f":"(SUMIF($BF$17:$BF$5002,\"Y\",$U$17:$U$5002))/10000","v":0},null,null,null,"COLUMN \"A\"","COLUMN \"B\"","COLUMN \"C\"",null,null,null,null,null,null,null,null,null,null,null,null,null,null,null,null,null,null,null,null,null,null,null,null,null,null,null,null,null,null,null,null,null,null,null,null,null,null,null,null,null,null,null,null,null,null,null,null,null,"1. HEIGHT (WEIGHTED)","2. HEALTH (WEIGHTED)","HOLLOWS 1, 2 OR 3 POINTS","3. HOLLOWS (WEIGHTED)","SUITABILITY FOR THREATENED SPECIES ","4. THREATENED SPECIES (WEIGHTED)","DENSITY","5. DENSITY  (WEIGHTED)","PROXIMITY TO OTHER VEG","6. PROXIMITY TO OTHER VEG. (WEIGHTED)","TOTAL SCORE","RECOMMENDATION","A 'FALSE' reading indicates Refusal under normal circumstances.","SEB Offset Area Requirement (total removal scattered trees)","NATIVE VEGETATION ACT","DEVELOPMENT ACT","TRANSPORT SERVICES DIVISION","DAC","Amenity",null,"Native veg. not covered by NVA",null,"NVA"]
[null,null,null,null,null,null,null,null,null,null,null,null,null,null,null,null,null,null,null,null,"TOTAL OTHER AREA (HA)",null,null,"TOTAL",null,null,null,null,null,null,null,null,null,null,null,null,null,null,null,null,null,null,null,null,null,null,null,null,null,null,null,null,null,null,null,null,null,null,null,null,"TOTAL",null,null,null,null,null,null,null,null,null,null,null,null,null,null,null,null,null,null,null,null,null,null,null,null,null,null,null,null,null,null,null,null,"Number","Area (m2) - 1:1 Replacement","Number of Plants - 1:1 Replacement","Area (m2) - 2:1 Replacement","Number of Plants - 2:1 Replacement","Number - Regulation 5(1)(lb) Only","Area (ha)\n(Condition Score x Area)","Total SEB amount for Area to be Removed (Ha)","LGC AVERAGE LAND VALUE "]
[null,null,null,null,null,null,null,null,null,null,null,null,null,null,null,null,null,null,null,null,null,null,null,null,{"$f":"(SUMIF($BC$17:$BC$5000,\"D\",$AA$17:$AA$5000))+(SUMIF($BC$17:$BC$5000,\"E\",$AA$17:$AA$5000))","v":0},{"$f":"(SUMIF($BD$17:$BD$5000,\"Y\",$AA$17:$AA$5000))","v":0},{"$f":"SUMIF($BE$17:$BE$5000,\"Y\",$AA$17:$AA$5000)","v":0}]
[null,null,null,null,null,null,null,null,null,null,null,null,null,null,null,null,null,null,null,null,{"$f":"(SUMIF($BF$17:$BF$5001,\"N\",$U16:$U$5001))/10000","v":0},null,null,"NVA SEB for AREA (HA)","COLUMN \"D\"","COLUMN \"E\"","COLUMN \"F\"",null,null,null,null,null,null,null,null,null,null,null,null,null,null,null,null,null,null,null,null,null,null,null,null,null,null,null,null,"AMENITY PLANTING","NATIVE VEGETATION","SUBJECT TO NATIVE VEGETATION ACT","SUBJECT TO DEVELOPMENT ACT",null,"NO IN GROUP WITH BUTT DIA. 0.15+ OR MS 0.10+",null,null,null,null,null,null,null,null,"HEALTH & CONDITION *",null,null,null,null,null,null,null,null,null,null,null,null,null,null,null,null,null,null,null,null,null,null,null,null,null,null,null,null,null,null,null,1,44567]
[null,null,null,null,null,null,null,null,null,null,null,null,null,null,null,null,null,null,null,null,"AREA OF VEGETATION TO BE REMOVED (m2)"]
[null,null,null,null,null,null,null,null,null,null,null,null,null,null,null,null,null,null,null,null,null,null,null,null,{"$f":"(SUMIF($BF$17:$BF$5000,\"Y\",$AA$17:$AA$5000))","v":0},{"$f":"SUMIF($BG$17:$BG$5000,\"Y\",$BH$17:$BH$5000)","v":0},{"$f":"(SUM($BH$17:$BH$5000))-((SUMIF($BF$17:$BF$5000,\"Y\",$BH$17:$BH$5000)))","v":0},null,null,null,null,null,null,null,null,null,null,null,null,null,null,null,null,null,null,null,null,null,null,null,null,null,null,null,null,null,null,null,null,null,null,null,null,null,null,null,null,null,null,null,null,null,null,null,null,null,null,null,null,null,null,null,null,null,null,null,null,null,null,null,null,null,null,null,null,null,null,null,null,null,{"$f":"X2","v":0}]
[null,null,null,null,null,null,null,null,null,null,null,null,null,null,null,null,null,null,null,null,null,null,null,null,"EASTING","NORTHING","NUMBER IN GROUP",null,null,null,null,null,null,null,null,null,null,null,null,null,null,null,null,null,null,null,null,null,null,null,null,null,null,null,null,null,null,null,null,null,null,null,null,null,null,null,null,null,null,null,null,null,null,null,null,null,null,null,null,null,null,null,null,null,null,null,null,null,null,null,null,null,null,null,null,null,null,null,null,null,{"$f":"(SUMIF(#REF!,\"Y\",CW56:CW57))/10000","v":{"$error":"#REF!"}},2,45667]
[null,null,null,null,null,null,null,null,null,null,null,null,"REMOVAL","MAJOR PRUNE","MINOR PRUNE","MONITOR",null,null,null,null,null,null,null,null,null,null,null,null,null,null,null,null,null,null,null,null,null,null,null,null,null,null,null,null,null,null,null,null,null,null,null,null,null,null,null,null,null,null,null,null,null,null,null,null,null,null,null,null,null,null,null,null,null,null,null,null,null,null,null,null,null,null,null,null,null,null,null,null,null,null,null,null,null,null,null,null,null,null,null,null,"SEB Offset Area Requirement for Scattered Trees (Ha)"]
[null,null,null,null,null,null,null,null,null,null,null,null,null,null,null,null,null,null,null,null,null,null,null,null,null,null,null,null,null,null,null,null,null,null,null,null,null,null,null,null,null,null,null,null,null,null,null,null,null,null,null,null,null,null,null,null,null,null,null,null,null,null,null,null,null,null,null,null,null,null,null,null,null,null,null,null,null,null,null,null,null,null,null,null,null,null,null,null,null,null,null,null,null,null,null,null,null,null,null,null,null,3,44567]
[null,null,null,null,"South Australian Legislation",null,null,null,null,null,null,null,null,null,null,null,null,null,null,null,null,null,null,null,null,null,null,null,null,null,null,null,null,null,null,null,null,null,null,null,null,null,null,null,null,null,null,null,null,null,null,null,null,null,null,null,null,null,null,null,null,null,null,null,null,null,null,null,null,null,null,null,null,null,null,null,null,null,null,null,null,null,null,null,null,null,null,null,"Number \"False\""]
[null,null,null,null,null,null,null,null,null,null,null,null,null,null,null,null,null,null,null,null,null,null,null,null,null,null,null,null,null,null,null,null,null,null,null,null,null,null,null,null,null,null,null,null,null,null,null,null,null,null,null,null,null,null,null,null,null,null,null,null,null,null,null,null,null,null,null,null,null,null,null,null,null,null,null,null,null,null,null,null,null,null,null,null,null,null,null,null,null,null,null,null,null,null,null,null,null,null,null,null,null,"CANOPY AREA (HA)"]
[null,null,null,null,null,null,null,null,null,null,null,null,null,null,null,null,null,null,null,null,null,null,null,null,null,null,null,null,null,null,null,null,null,null,null,null,null,null,null,null,null,null,null,null,null,null,null,null,null,null,null,null,null,null,null,null,null,null,null,null,null,null,null,null,null,null,null,null,null,null,null,null,null,null,null,null,null,null,null,null,null,null,null,null,null,null,null,null,{"$f":"SUMIF(CK16:CK4892,\"FALSE\",AA16:AA4892)","v":0}]
[null,null,null,null,null,null,null,null,null,null,null,null,null,null,null,null,null,null,null,null,null,null,null,null,null,null,null,null,null,null,null,null,null,null,null,null,null,null,null,null,null,null,null,null,null,null,null,null,null,null,null,null,null,null,null,null,null,null,null,null,null,null,null,null,null,null,null,null,null,null,null,null,null,null,null,null,null,null,null,null,null,null,null,null,null,null,null,null,null,null,null,null,null,null,null,null,null,null,null,null,null,{"$f":"SUM(CY19:CY20)+SUM(CY22:CY23)/100*20","v":0}]
[null,null,null,null,null,null,null,null,null,null,null,null,null,null,null,null,null,null,null,null,null,null,null,null,null,null,null,null,null,null,null,null,null,null,null,null,null,null,null,null,null,null,null,null,null,null,null,null,null,null,null,null,null,null,null,null,null,null,null,null,null,null,null,null,null,null,null,null,null,null,null,null,{"$f":"(IF(BT16=\"\",\"\",((BT16*50)^0.42)*0.64))","v":""}]
[null,null,null,null,null,null,null,null,null,null,null,null,null,null,null,null,null,null,null,null,null,{"$f":"IF(BF17=\"\",\"\",(IF(U17=\"\",\"\",(IF(BF17=\"N\",\"\",(IF(BF17=\"Y\",U17)))))))","v":""},null,{"$f":"IF(V17=\"\",\"\",(IF(BF17=\"N\",\"\",((V17*W17)/10000))))","v":""},null,null,null,{"$f":"IF(M17=\"\",0,(IF(T17=\"\",0,(IF(T17=\"Y\",0,(IF(S17=\"Y\",0, (IF(R17=\"Y\",0,(IF(BF17=\"N\",0,(IF(M17=\"P\",AA17)))))))))))))","v":0},{"$f":"IF(N17=\"\",0,(IF(T17=\"\",0,(IF(T17=\"Y\",0,(IF(S17=\"Y\",0, (IF(R17=\"Y\",0,(IF(BF17=\"N\",0,(IF(N17=\"P\",AA17)))))))))))))","v":0},{"$f":"IF(M17=\"\",0,(IF(T17=\"\",0,(IF(T17=\"N\",0,(IF(S17=\"Y\",0,(IF(BF17=\"N\",0,(IF(T17=\"Y\",(X17))))))))))))","v":0},{"$f":"IF(M17=\"\",0,(IF(T17=\"\",0,(IF(T17=\"Y\",0,(IF(S17=\"N\",0,(IF(BF17=\"N\",0,(IF(M17=\"P\",AA17)))))))))))","v":0},{"$f":"IF(N17=\"\",0,(IF(T17=\"\",0,(IF(T17=\"Y\",0,(IF(S17=\"N\",0, (IF(BF17=\"N\",0,(IF(N17=\"P\",AA17)))))))))))","v":0},{"$f":"IF(M17=\"\",0,(IF(T17=\"\",0,(IF(S17=\"N\",0,(IF(BF17=\"N\",0,(IF(T17=\"N\",0,(IF(T17=\"Y\",U17)))))))))))","v":0},{"$f":"IF(M17=\"\",0,(IF(T17=\"\",0,(IF(T17=\"Y\",0,(IF(S17=\"Y\",0,(IF(R17=\"N\",0,(IF(BF17=\"N\",0,(IF(M17=\"P\",AA17)))))))))))))","v":0},{"$f":"IF(N17=\"\",0,(IF(T17=\"\",0,(IF(T17=\"Y\",0,(IF(R17=\"N\",0, (IF(BF17=\"N\",0,(IF(N17=\"P\",AA17)))))))))))","v":0},{"$f":"IF(M17=\"\",0,(IF(BC17=\"N\",0,(IF(BD17=\"Y\",0,(IF(T17=\"Y\",0,(IF(BC17=\"E\",AA17,(IF(BC17=\"D\",AA17,(IF(BC17=\"O\",AA17,(IF(BC17=\"M\",AA17)))))))))))))))","v":0},{"$f":"IF(N17=\"\",0,(IF(BH17>0,0,(IF(BC17=\"N\",0,(IF(BD17=\"Y\",0,(IF(T17=\"Y\",0,(IF(BC17=\"E\",AA17,(IF(BC17=\"D\",AA17,(IF(BC17=\"O\",AA17,(IF(BC17=\"M\",AA17)))))))))))))))))","v":0},{"$f":"IF(M17=\"\",0,(IF(U17=\"\",0,(IF(BC17=\"N\",0,(IF(BD17=\"Y\",0,IF(T17=\"N\",0,(IF(BC17=\"E\",U17,(IF(BC17=\"D\",U17,(IF(BC17=\"O\",U17,(IF(BC17=\"M\",U17))))))))))))))))","v":0},{"$f":"(IF(M17=\"\",0,(IF(BE17=\"N\",0,(IF(BF17=\"Y\",0,(IF(BI17=0,0,(IF(BI17=\"\",\"\",(IF(Q17=\"Y\",0,(IF(R17=\"Y\",0,(IF(T17=\"Y\",0,(IF(BE17=\"Y\",AA17))))))))))))))))))","v":0},{"$f":"IF(N17=\"\",0,(IF(BE17=\"N\",0,(IF(BF17=\"Y\",0,(IF(BI17=0,0,(IF(BI17=\"\",0,(IF(Q17=\"Y\",0,(IF(R17=\"Y\",0,(IF(T17=\"Y\",0,(IF(BE17=\"Y\",AA17)))))))))))))))))","v":0},{"$f":"IF(M17=\"\",0,(IF(U17=\"\",0,(IF(T17=\"N\",0,(IF(BE17=\"N\",0,(IF(BF17=\"Y\",0,(IF(BE17=\"Y\",U17)))))))))))","v":0},{"$f":"(IF(M17=\"\",0,(IF(T17=\"Y\",0,(IF(S17=\"Y\",0,(IF(BD17=\"Y\",0,(IF(BE17=\"N\",0,(IF(BF17=\"Y\",0,(IF(BI17=0,0,(IF(BI17=\"\",\"\",(IF(R17=\"N\",0,(IF(R17=\"Y\",AA17))))))))))))))))))))+(IF(M17=\"\",0,(IF(R17=\"Y\",0,(IF(T17=\"Y\",0,(IF(S17=\"Y\",0,(IF(BD17=\"Y\",0,(IF(BE17=\"N\",0,(IF(BF17=\"Y\",0,(IF(BI17=0,0,(IF(BI17=\"\",\"\",(IF(Q17=\"Y\",AA17))))))))))))))))))))","v":0},{"$f":"(IF(N17=\"\",0,(IF(T17=\"\",0,(IF(T17=\"Y\",0,(IF(R17=\"N\",0, (IF(BF17=\"Y\",0,(IF(BE17=\"N\",0,(IF(BI17=0,0,(IF(BI17=\"\",\"\",(IF(R17=\"Y\",AA17))))))))))))))))))+(IF(N17=\"\",0,(IF(T17=\"\",0,(IF(T17=\"Y\",0,(IF(R17=\"Y\",0, (IF(BF17=\"Y\",0,(IF(BE17=\"N\",0,(IF(BI17=0,0,(IF(BI17=\"\",\"\",(IF(Q17=\"Y\",AA17))))))))))))))))))","v":0},{"$f":"(IF(M17=\"\",0,(IF(T17=\"Y\",0,(IF(BG17=\"Y\",0,(IF(BD17=\"N\",0,(IF(Q17=\"Y\",0,(IF(R17=\"Y\",0,(IF(BD17=\"Y\",AA17))))))))))))))","v":0},{"$f":"IF(N17=\"\",0,(IF(BD17=\"\",0,(IF(BD17=\"N\",0,(IF(BH17>0,0,(IF(T17=\"Y\",0,(IF(R17=\"Y\",0,(IF(Q17=\"Y\",0,(IF(BD17=\"Y\",AA17)))))))))))))))","v":0},{"$f":"IF(M17=\"\",0,(IF(BD17=\"\",0,(IF(BD17=\"N\",0,(IF(T17=\"N\",0,(IF(Q17=\"Y\",0,(IF(BD17=\"Y\",U17)))))))))))","v":0},{"$f":"(IF(M17=\"\",0,(IF(T17=\"\",0,(IF(T17=\"Y\",0,(IF(S17=\"Y\",0,(IF(R17=\"N\",0,(IF(BD17=\"N\",0,(IF(BE17=\"Y\",0,(IF(R17=\"Y\",AA17))))))))))))))))+(IF(R17=\"Y\",0,(IF(M17=\"\",0,(IF(BD17=\"N\",0,(IF(T17=\"\",0,(IF(T17=\"Y\",0,(IF(S17=\"Y\",0,(IF(BE17=\"Y\",0,(IF(Q17=\"Y\",AA17))))))))))))))))","v":0},{"$f":"(IF(N17=\"\",0,(IF(T17=\"\",0,(IF(T17=\"Y\",0,(IF(R17=\"N\",0,(IF(S17=\"Y\",0,(IF(BE17=\"Y\",0,(IF(BD17=\"N\",0,(IF(R17=\"Y\",AA17))))))))))))))))+(IF(R17=\"Y\",0,(IF(N17=\"\",0,(IF(T17=\"\",0,(IF(T17=\"Y\",0,(IF(S17=\"Y\",0,(IF(BE17=\"Y\",0,(IF(BD17=\"N\",0,(IF(Q17=\"Y\",AA17))))))))))))))))","v":0},{"$f":"IF(M17=\"\",0,(IF(BF17=\"Y\",0,(IF(BH17=\"\",0,(IF(BG17=\"N\",0,(IF(BH17=\"R\",0,(IF(BH17=\"S\",AA17)))))))))))","v":0},{"$f":"(IF(AW17=0,0,AW17))*3","v":0},{"$f":"IF(N17=\"\",0,(IF(BF17=\"Y\",0,(IF(BG17=\"N\",0,(IF(BH17=\"R\",0,(IF(BH17=\"S\",AA17)))))))))","v":0},{"$f":"IF(M17=\"\",0,(IF(BF17=\"Y\",0,(IF(BG17=\"N\",0,(IF(BH17=\"\",0,(IF(BH17=\"S\",0,(IF(BH17=\"R\",AA17)))))))))))","v":0},{"$f":"(IF(AZ17=0,0,AZ17))*2","v":0},{"$f":"IF(N17=\"\",0,(IF(BF17=\"Y\",0,(IF(BG17=\"N\",0,(IF(BH17=\"S\",0,(IF(BH17=\"R\",AA17)))))))))","v":0},null,null,null,null,null,null,null,null,null,null,null,null,null,null,null,null,{"$f":"IF(BK17=\"\",\"\",(BK17*12))","v":""},null,"",null,null,null,{"$f":"IF(BF17=\"\",\"\",(IF(BF17=\"N\",\"\",(IF(BF17=\"Y\",(IF(BN17=\"\",\"\",(IF($BN17<10,1,(IF($BN17<20,2,3))))*1.05)))))))","v":""},{"$f":"IF(BV17=\"\",\"\",(IF(BF17=\"N\",\"\",(IF(BF17=\"Y\",((100-$BV17)*0.04)+2)))))","v":""},null,{"$f":"IF(CA17=\"\",\"\",(IF(BF17=\"N\",\"\",(IF(BF17=\"Y\",(CA17*1.45))))))","v":""},null,{"$f":"IF(CC17=\"\",\"\",(IF(BF17=\"N\",\"\",(IF(BF17=\"Y\",(CC17*0.65))))))","v":""},null,{"$f":"IF(CE17=\"\",\"\",(IF(BF17=\"N\",\"\",(IF(BF17=\"Y\",(CE17*0.4))))))","v":""},null,{"$f":"IF(CG17=\"\",\"\",(IF(BF17=\"N\",\"\",(IF(BF17=\"Y\",(CG17*0.35))))))","v":""},{"$f":"IF(BY17=\"\",\"\",(SUM(BY17,BZ17,CB17,CD17,CF17,CH17)*SUM(BY17,BZ17,CB17,CD17,CF17,CH17)*SUM(BY17,BZ17,CB17,CD17,CF17,CH17)/55.5))","v":""},{"$f":"IF(CI17=\"\",\"\",IF(CI17<30,0,(IF(CI17>=30,1))))","v":""},{"$f":"IF(CI17=\"\",\"\",(IF(CJ17=1,CJ17=\"@\",(IF(CJ17=0,(IF($CI17<20,4*$CI17/550,(IF($CI17<30,6*$CI17/550,(IF($CI17<41,8*$CI17/550,(IF($CI17<61,10*$CI17/550,12*$CI17/550)))))))))))))","v":""},{"$f":"IF(CI17=\"\",\"\",((IF($CI17<20,4*$CI17/550,(IF($CI17<29.1,6*$CI17/550,(IF($CI17<40.1,8*$CI17/550,(IF($CI17<60.1,10*$CI17/550,12*$CI17/550))))))))*AA17))","v":""},{"$f":"IF(BF17=\"\",\"\",(IF(BF17=\"N\",\"\",(IF(T17=\"Y\",\"Y\",(IF(AA17=\"\",\"Y\",(IF(AA17=0,\"\",(IF(BF17=\"Y\",(AB17+AC17+AE17+AF17+AH17+AI17))))))))))))","v":""},{"$f":"IF(BG17=\"\",\"\",(IF(BG17=\"N\",\"\",(IF(BF17=\"Y\",\"\",(IF(Q17=\"Y\",\"\",(IF(BG17=\"Y\",(AW17+AY17+AZ17+BB17))))))))))","v":""},{"$f":"(IF(BF17=\"Y\",\"\",(IF(BG17=\"Y\",\"\",(IF(AL17>0,\"\",(IF(T17=\"Y\",\"Y\",(IF(AA17=\"\",\"\",(IF(AJ17>0,BI17,(IF(AK17>0,BI17,(AM17+AN17+AR17+AS17+AU17+AV17+AP17+AQ17)))))))))))))))","v":""},{"$f":"(IF(AA17=\"\",\"\",(IF(M17=\"\",\"\",(IF(Q17=\"Y\",\"\",(IF(BG17=\"N\",\"\",(IF(BF17=\"Y\",\"\",(IF(BG17=\"Y\",(AX17+BA17)))))))))))))","v":""},{"$f":"IF(AT17=0,\"\",(IF(AQ17=\"Y\",\"\",(AT17))))","v":""},{"$f":"IF(AA17=\"\",\"\",(IF(Q17=\"Y\",\"\",(IF(AR17=0,\"\",(AR17))))))","v":""},{"$f":"IF(AO17=0,\"\",(IF(Q17=\"Y\",\"\",(AO17*2))))","v":""},{"$f":"IF(AM17=0,\"\",(IF(Q17=\"Y\",\"\",(AM17*2))))","v":""},{"$f":"(IF(AE17=0,\"\",(IF(Q17=\"Y\",\"\",(AE17*2)))))","v":""},{"$f":"IF(AD17=0,\"\",(IF(Q17=\"Y\",\"\",(AD17))))","v":""},{"$f":"IF(BN17=\"\",\"\",(IF(S17=\"Y\",\"\",(IF(R17=\"Y\",\"\",(IF(Q17=\"Y\",\"\",(IF(T17=\"Y\",\"\",(IF(BF17=\"\",\"\",(IF(BF17=\"N\",\"\",(CL17))))))))))))))","v":""},{"$f":"IF(BF17=\"\",\"\",(IF(BF17=\"N\",\"\",(IF(BP17=\"\",\"\",(IF(R17=\"Y\",\"\",(IF(T17=\"Y\",\"\",(IF($CY$6=\"\",\"\",(IF(AA17=\"\",\"\",(PI()*((BP17/2)*(BP17/2)))/10000*AA17)))))))))))))","v":""}]
[null,null,null,"test","Acacia aneura",null,null,null,null,null,null,null,null,null,null,null,null,null,null,null,null,"",null,"",null,null,null,0,0,0,0,0,0,0,0,0,0,0,0,0,0,0,0,0,0,0,0,0,0,0,0,0,0,0,null,null,null,null,null,null,null,null,null,null,null,null,null,null,null,null,"",null,{"$f":"(IF(BT18=\"\",\"\",((BT18*50)^0.42)*0.64))","v":""},null,null,null,{"$f":"IF(BF18=\"\",\"\",(IF(BF18=\"N\",\"\",(IF(BF18=\"Y\",(IF(BN18=\"\",\"\",(IF(BN18<4,1,(IF(BN18<7,2,3))))*1.05)))))))","v":""},{"$f":"IF(BV18=\"\",\"\",(IF(BF18=\"N\",\"\",(IF(BF18=\"Y\",((100-BV18)*0.04)+2)))))","v":""},null,{"$f":"IF(CA18=\"\",\"\",(IF(BF18=\"N\",\"\",(IF(BF18=\"Y\",(CA18*1.45))))))","v":""},null,{"$f":"IF(CC18=\"\",\"\",(IF(BF18=\"N\",\"\",(IF(BF18=\"Y\",(CC18*0.65))))))","v":""},null,{"$f":"IF(CE18=\"\",\"\",(IF(BF18=\"N\",\"\",(IF(BF18=\"Y\",(CE18*0.4))))))","v":""},null,{"$f":"IF(CG18=\"\",\"\",(IF(BF18=\"N\",\"\",(IF(BF18=\"Y\",(CG18*0.35))))))","v":""},{"$f":"IF(BY18=\"\",\"\",(SUM(BY18,BZ18,CB18,CD18,CF18,CH18)*SUM(BY18,BZ18,CB18,CD18,CF18,CH18)*SUM(BY18,BZ18,CB18,CD18,CF18,CH18)/55.5))","v":""},{"$f":"IF(CI18=\"\",\"\",IF(CI18<30,0,(IF(CI18>=30,1))))","v":""},{"$f":"IF(CI18=\"\",\"\",(IF(CJ18=1,CJ18=\"@\",(IF(CJ18=0,(IF($CI18<20,4*$CI18/550,(IF($CI18<30,6*$CI18/550,(IF($CI18<41,8*$CI18/550,(IF($CI18<61,10*$CI18/550,12*$CI18/550)))))))))))))","v":""},"","","","","","","","","","","","",{"$f":"IF(BF18=\"\",\"\",(IF(BF18=\"N\",\"\",(IF(BP18=\"\",\"\",(IF(R18=\"Y\",\"\",(IF(T18=\"Y\",\"\",(IF($CY$6=\"\",\"\",(IF(AA18=\"\",\"\",(PI()*((BP18/2)*(BP18/2)))/10000*AA18)))))))))))))","v":""}]
[null,null,null,"Arid Areas","Acacia aneura",null,null,null,null,null,null,null,null,null,null,null,null,null,null,null,null,"",null,"",null,null,null,0,0,0,0,0,0,0,0,0,0,0,0,0,0,0,0,0,0,0,0,0,0,0,0,0,0,0,null,null,null,null,null,null,null,null,null,null,null,null,null,null,null,null,"",null,"",null,null,null,{"$f":"IF(BF19=\"\",\"\",(IF(BF19=\"N\",\"\",(IF(BF19=\"Y\",(IF(BN19=\"\",\"\",(IF($BN19<5,1,(IF($BN19<10,2,3))))*1.05)))))))","v":""},{"$f":"IF(BV19=\"\",\"\",(IF(BF19=\"N\",\"\",(IF(BF19=\"Y\",((100-$BV19)*0.04)+2)))))","v":""},null,"",null,"",null,"",null,"","","","","","","","","","","","","","","","",{"$f":"IF(BF19=\"\",\"\",(IF(BF19=\"N\",\"\",(IF(BP19=\"\",\"\",(IF(R19=\"Y\",\"\",(IF(T19=\"Y\",\"\",(IF($CY$6=\"\",\"\",(IF(AA19=\"\",\"\",(PI()*((BP19/2)*(BP19/2)))/10000*AA19)))))))))))))","v":""}]
[null,null,null,"Arid Areas (Badman 21/11/03)","Acacia ayersiana",null,null,null,null,null,null,null,null,null,null,null,null,null,null,null,null,"",null,"",null,null,null,0,0,0,0,0,0,0,0,0,0,0,0,0,0,0,0,0,0,0,0,0,0,0,0,0,0,0,null,null,null,null,null,null,null,null,null,null,null,null,null,null,null,null,"",null,"",null,null,null,{"$f":"IF(BF20=\"\",\"\",(IF(BF20=\"N\",\"\",(IF(BF20=\"Y\",(IF(BN20=\"\",\"\",(IF($BN20<3.5,1,(IF($BN20<5,2,3))))*1.05)))))))","v":""},"",null,"",null,"",null,"",null,"","","","","","","","","","","","","","","","",""]
[null,null,null,null,"Acacia calamifolia",null,null,null,null,null,null,null,null,null,null,null,null,null,null,null,null,"",null,"",null,null,null,0,0,0,0,0,0,0,0,0,0,0,0,0,0,0,0,0,0,0,0,0,0,0,0,0,0,0,null,null,null,null,null,null,null,null,null,null,null,null,null,null,null,null,"",null,"",null,null,null,{"$f":"IF(BF21=\"\",\"\",(IF(BF21=\"N\",\"\",(IF(BF21=\"Y\",(IF(BN21=\"\",\"\",(IF($BN21<2,1,(IF($BN21<3.5,2,3))))*1.05)))))))","v":""},"",null,"",null,"",null,"",null,"","","","","","","","","","","","","","","","",""]
[null,null,null,"Arid Areas (Badman 21/11/03)","Acacia calcicola",null,null,null,null,null,null,null,null,null,null,null,null,null,null,null,null,"",null,"",null,null,null,0,0,0,0,0,0,0,0,0,0,0,0,0,0,0,0,0,0,0,0,0,0,0,0,0,0,0,null,null,null,null,null,null,null,null,null,null,null,null,null,null,null,null,"",null,"",null,null,null,{"$f":"IF(BF22=\"\",\"\",(IF(BF22=\"N\",\"\",(IF(BF22=\"Y\",(IF(BN22=\"\",\"\",(IF($BN22<3,1,(IF($BN22<4,2,3))))*1.05)))))))","v":""},"",null,"",null,"",null,"",null,"","","","","","","","","","","","","","","","",""]
[null,null,null,"Arid Areas (Badman 21/11/03)","Acacia cambagei",null,null,null,null,null,null,null,null,null,null,null,null,null,null,null,null,"",null,"",null,null,null,0,0,0,0,0,0,0,0,0,0,0,0,0,0,0,0,0,0,0,0,0,0,0,0,0,0,0,null,null,null,null,null,null,null,null,null,null,null,null,null,null,null,null,"",null,"",null,null,null,{"$f":"IF(BF23=\"\",\"\",(IF(BF23=\"N\",\"\",(IF(BF23=\"Y\",(IF(BN23=\"\",\"\",(IF($BN23<4,1,(IF($BN23<5.5,2,3))))*1.05)))))))","v":""},"",null,"",null,"",null,"",null,"","","","","","","","","","","","","","","","",""]
[null,null,null,"Arid Areas (Badman 21/11/03)","Acacia cibaria",null,null,null,null,null,null,null,null,null,null,null,null,null,null,null,null,"",null,"",null,null,null,0,0,0,0,0,0,0,0,0,0,0,0,0,0,0,0,0,0,0,0,0,0,0,0,0,0,0,null,null,null,null,null,null,null,null,null,null,null,null,null,null,null,null,"",null,"",null,null,null,{"$f":"IF(BF24=\"\",\"\",(IF(BF24=\"N\",\"\",(IF(BF24=\"Y\",(IF(BN24=\"\",\"\",(IF($BN24<2.5,1,(IF($BN24<3.5,2,3))))*1.05)))))))","v":""},"",null,"",null,"",null,"",null,"","","","","","","","","","","","","","","","",""]
[null,null,null,"Arid Areas (Badman 21/11/03)","Acacia cyperophylla",null,null,null,null,null,null,null,null,null,null,null,null,null,null,null,null,"",null,"",null,null,null,0,0,0,0,0,0,0,0,0,0,0,0,0,0,0,0,0,0,0,0,0,0,0,0,0,0,0,null,null,null,null,null,null,null,null,null,null,null,null,null,null,null,null,"",null,"",null,null,null,{"$f":"IF(BF25=\"\",\"\",(IF(BF25=\"N\",\"\",(IF(BF25=\"Y\",(IF(BN25=\"\",\"\",(IF($BN25<4,1,(IF($BN25<5.5,2,3))))*1.05)))))))","v":""},"",null,"",null,"",null,"",null,"","","","","","","","","","","","","","","","",""]
[null,null,null,"Arid Areas (Badman 21/11/03)","Acacia dictyophleba",null,null,null,null,null,null,null,null,null,null,null,null,null,null,null,null,"",null,"",null,null,null,0,0,0,0,0,0,0,0,0,0,0,0,0,0,0,0,0,0,0,0,0,0,0,0,0,0,0,null,null,null,null,null,null,null,null,null,null,null,null,null,null,null,null,"",null,"",null,null,null,{"$f":"IF(BF26=\"\",\"\",(IF(BF26=\"N\",\"\",(IF(BF26=\"Y\",(IF(BN26=\"\",\"\",(IF($BN26<2.5,1,(IF($BN26<3,2,3))))*1.05)))))))","v":""},"",null,"",null,"",null,"",null,"","","","","","","","","","","","","","","","",""]
[null,null,null,"Rated Rare - June 2014 - 20% loading added to SEB","Acacia dodonaeifolia",null,null,null,null,null,null,null,null,null,null,null,null,null,null,null,null,"",null,"",null,null,null,0,0,0,0,0,0,0,0,0,0,0,0,0,0,0,0,0,0,0,0,0,0,0,0,0,0,0,null,null,null,null,null,null,null,null,null,null,null,null,null,null,null,null,"",null,"",null,null,null,{"$f":"IF(BF27=\"\",\"\",(IF(BF27=\"N\",\"\",(IF(BF27=\"Y\",(IF(BN27=\"\",\"\",(IF($BN27<1.5,1,(IF($BN27<3,2,3))))*1.05)))))))","v":""},"",null,"",null,"",null,"",null,"","","","",{"$f":"IF(CI27=\"\",\"\",(((IF($CI27<20,4*$CI27/550,(IF($CI27<29.1,6*$CI27/550,(IF($CI27<40.1,8*$CI27/550,(IF($CI27<60.1,10*$CI27/550,12*$CI27/550))))))))*AA27))*120/100)","v":""},"","","","","","","","","","","",""]
[null,null,null,"Arid Areas (Badman 21/11/03)","Acacia estrophiolata",null,null,null,null,null,null,null,null,null,null,null,null,null,null,null,null,"",null,"",null,null,null,0,0,0,0,0,0,0,0,0,0,0,0,0,0,0,0,0,0,0,0,0,0,0,0,0,0,0,null,null,null,null,null,null,null,null,null,null,null,null,null,null,null,null,"",null,"",null,null,null,{"$f":"IF(BF28=\"\",\"\",(IF(BF28=\"N\",\"\",(IF(BF28=\"Y\",(IF(BN28=\"\",\"\",(IF($BN28<4,1,(IF($BN28<6,2,3))))*1.05)))))))","v":""},"",null,"",null,"",null,"",null,"","","","",{"$f":"IF(CI28=\"\",\"\",((IF($CI28<20,4*$CI28/550,(IF($CI28<29.1,6*$CI28/550,(IF($CI28<40.1,8*$CI28/550,(IF($CI28<60.1,10*$CI28/550,12*$CI28/550))))))))*AA28))","v":""},"","","","","","","","","","","",""]
[null,null,null,"Arid Areas (Badman 21/11/03)","Acacia farnesiana",null,null,null,null,null,null,null,null,null,null,null,null,null,null,null,null,"",null,"",null,null,null,0,0,0,0,0,0,0,0,0,0,0,0,0,0,0,0,0,0,0,0,0,0,0,0,0,0,0,null,null,null,null,null,null,null,null,null,null,null,null,null,null,null,null,"",null,"",null,null,null,{"$f":"IF(BF29=\"\",\"\",(IF(BF29=\"N\",\"\",(IF(BF29=\"Y\",(IF(BN29=\"\",\"\",(IF($BN29<2.3,1,(IF($BN29<3,2,3))))*1.05)))))))","v":""},"",null,"",null,"",null,"",null,"","","","","","","","","","","","","","","","",""]
[null,null,null,"Arid Areas (Badman 21/11/03)","Acacia kempeana",null,null,null,null,null,null,null,null,null,null,null,null,null,null,null,null,"",null,"",null,null,null,0,0,0,0,0,0,0,0,0,0,0,0,0,0,0,0,0,0,0,0,0,0,0,0,0,0,0,null,null,null,null,null,null,null,null,null,null,null,null,null,null,null,null,"",null,"",null,null,null,{"$f":"IF(BF30=\"\",\"\",(IF(BF30=\"N\",\"\",(IF(BF30=\"Y\",(IF(BN30=\"\",\"\",(IF($BN30<2.5,1,(IF($BN30<3,2,3))))*1.05)))))))","v":""},"",null,"",null,"",null,"",null,"","","","","","","","","","","","","","","","",""]
[null,null,null,null,"Acacia ligulata",null,null,null,null,null,null,null,null,null,null,null,null,null,null,null,null,"",null,"",null,null,null,0,0,0,0,0,0,0,0,0,0,0,0,0,0,0,0,0,0,0,0,0,0,0,0,0,0,0,null,null,null,null,null,null,null,null,null,null,null,null,null,null,null,null,"",null,"",null,null,null,{"$f":"IF(BF31=\"\",\"\",(IF(BF31=\"N\",\"\",(IF(BF31=\"Y\",(IF(BN31=\"\",\"\",(IF($BN31<1.5,1,(IF($BN31<3,2,3))))*1.05)))))))","v":""},"",null,"",null,"",null,"",null,"","","","","","","","","","","","","","","","",""]
[null,null,null,null,"Acacia longilfolia var sophorae",null,null,null,null,null,null,null,null,null,null,null,null,null,null,null,null,"",null,"",null,null,null,0,0,0,0,0,0,0,0,0,0,0,0,0,0,0,0,0,0,0,0,0,0,0,0,0,0,0,null,null,null,null,null,null,null,null,null,null,null,null,null,null,null,null,"",null,"",null,null,null,{"$f":"IF(BF32=\"\",\"\",(IF(BF32=\"N\",\"\",(IF(BF32=\"Y\",(IF(BN32=\"\",\"\",(IF($BN32<1.5,1,(IF($BN32<3,2,3))))*1.05)))))))","v":""},"",null,"",null,"",null,"",null,"","","","","","","","","","","","","","","","",""]
[null,null,null,null,"Acacia mearnsii",null,null,null,null,null,null,null,null,null,null,null,null,null,null,null,null,"",null,"",null,null,null,0,0,0,0,0,0,0,0,0,0,0,0,0,0,0,0,0,0,0,0,0,0,0,0,0,0,0,null,null,null,null,null,null,null,null,null,null,null,null,null,null,null,null,"",null,"",null,null,null,{"$f":"IF(BF33=\"\",\"\",(IF(BF33=\"N\",\"\",(IF(BF33=\"Y\",(IF(BN33=\"\",\"\",(IF($BN33<3.4,1,(IF($BN33<6.8,2,3))))*1.05)))))))","v":""},"",null,"",null,"",null,"",null,"","","","","","","","","","","","","","","","",""]
[null,null,null,null,"Acacia melanoxylon",null,null,null,null,null,null,null,null,null,null,null,null,null,null,null,null,"",null,"",null,null,null,0,0,0,0,0,0,0,0,0,0,0,0,0,0,0,0,0,0,0,0,0,0,0,0,0,0,0,null,null,null,null,null,null,null,null,null,null,null,null,null,null,null,null,"",null,"",null,null,null,{"$f":"IF(BF34=\"\",\"\",(IF(BF34=\"N\",\"\",(IF(BF34=\"Y\",(IF(BN34=\"\",\"\",(IF($BN34<6,1,(IF($BN34<10,2,3))))*1.05)))))))","v":""},"",null,"",null,"",null,"",null,"","","","","","","","","","","","","","","","",""]
[null,null,null,"Arid Areas (Badman 21/11/03)","Acacia murrayana",null,null,null,null,null,null,null,null,null,null,null,null,null,null,null,null,"",null,"",null,null,null,0,0,0,0,0,0,0,0,0,0,0,0,0,0,0,0,0,0,0,0,0,0,0,0,0,0,0,null,null,null,null,null,null,null,null,null,null,null,null,null,null,null,null,"",null,"",null,null,null,{"$f":"IF(BF35=\"\",\"\",(IF(BF35=\"N\",\"\",(IF(BF35=\"Y\",(IF(BN35=\"\",\"\",(IF($BN35<31,(IF($BN35<4,2,3))))*1.05)))))))","v":""},"",null,"",null,"",null,"",null,"","","","","","","","","","","","","","","","",""]
[null,null,null,null,"Acacia oswaldii",null,null,null,null,null,null,null,null,null,null,null,null,null,null,null,null,"",null,"",null,null,null,0,0,0,0,0,0,0,0,0,0,0,0,0,0,0,0,0,0,0,0,0,0,0,0,0,0,0,null,null,null,null,null,null,null,null,null,null,null,null,null,null,null,null,"",null,"",null,null,null,{"$f":"IF(BF36=\"\",\"\",(IF(BF36=\"N\",\"\",(IF(BF36=\"Y\",(IF(BN36=\"\",\"\",(IF($BN36<1.5,1,(IF($BN36<3,2,3))))*1.05)))))))","v":""},"",null,"",null,"",null,"",null,"","","","","","","","","","","","","","","","",""]
[null,null,null,"Arid Areas (Badman 21/11/03)","Acacia papyrocarpa",null,null,null,null,null,null,null,null,null,null,null,null,null,null,null,null,"",null,"",null,null,null,0,0,0,0,0,0,0,0,0,0,0,0,0,0,0,0,0,0,0,0,0,0,0,0,0,0,0,null,null,null,null,null,null,null,null,null,null,null,null,null,null,null,null,"",null,"",null,null,null,{"$f":"IF(BF37=\"\",\"\",(IF(BF37=\"N\",\"\",(IF(BF37=\"Y\",(IF(BN37=\"\",\"\",(IF($BN37<3,1,(IF($BN37<4.5,2,3))))*1.05)))))))","v":""},"",null,"",null,"",null,"",null,"","","","","","","","","","","","","","","","",""]
[null,null,null,null,"Acacia paradoxa",null,null,null,null,null,null,null,null,null,null,null,null,null,null,null,null,"",null,"",null,null,null,0,0,0,0,0,0,0,0,0,0,0,0,0,0,0,0,0,0,0,0,0,0,0,0,0,0,0,null,null,null,null,null,null,null,null,null,null,null,null,null,null,null,null,"",null,"",null,null,null,{"$f":"IF(BF38=\"\",\"\",(IF(BF38=\"N\",\"\",(IF(BF38=\"Y\",(IF(BN38=\"\",\"\",(IF($BN38<1.5,1,(IF($BN38<2.5,2,3))))*1.05)))))))","v":""},"",null,"",null,"",null,"",null,"","","","","","","","","","","","","","","","",""]
[null,null,null,"Arid Areas (Badman 21/11/03)\nRated Rare - June 2014 - 20% loading added to SEB","Acacia pickardii",null,null,null,null,null,null,null,null,null,null,null,null,null,null,null,null,"",null,"",null,null,null,0,0,0,0,0,0,0,0,0,0,0,0,0,0,0,0,0,0,0,0,0,0,0,0,0,0,0,null,null,null,null,null,null,null,null,null,null,null,null,null,null,null,null,"",null,"",null,null,null,{"$f":"IF(BF39=\"\",\"\",(IF(BF39=\"N\",\"\",(IF(BF39=\"Y\",(IF(BN39=\"\",\"\",(IF($BN39<3,1,(IF($BN39<4,2,3))))*1.05)))))))","v":""},"",null,"",null,"",null,"",null,"","","","",{"$f":"IF(CI39=\"\",\"\",(((IF($CI39<20,4*$CI39/550,(IF($CI39<29.1,6*$CI39/550,(IF($CI39<40.1,8*$CI39/550,(IF($CI39<60.1,10*$CI39/550,12*$CI39/550))))))))*AA39))*120/100)","v":""},"","","","","","","","","","","",""]
[null,null,null,null,"Acacia pycnantha",null,null,null,null,null,null,null,null,null,null,null,null,null,null,null,null,"",null,"",null,null,null,0,0,0,0,0,0,0,0,0,0,0,0,0,0,0,0,0,0,0,0,0,0,0,0,0,0,0,null,null,null,null,null,null,null,null,null,null,null,null,null,null,null,null,"",null,"",null,null,null,{"$f":"IF(BF40=\"\",\"\",(IF(BF40=\"N\",\"\",(IF(BF40=\"Y\",(IF(BN40=\"\",\"\",(IF($BN40<2.5,1,(IF($BN40<5,2,3))))*1.05)))))))","v":""},"",null,"",null,"",null,"",null,"","","","",{"$f":"IF(CI40=\"\",\"\",((IF($CI40<20,4*$CI40/550,(IF($CI40<29.1,6*$CI40/550,(IF($CI40<40.1,8*$CI40/550,(IF($CI40<60.1,10*$CI40/550,12*$CI40/550))))))))*AA40))","v":""},"","","","","","","","","","","",""]
[null,null,null,"Arid Areas (Badman 21/11/03)","Acacia ramulosa",null,null,null,null,null,null,null,null,null,null,null,null,null,null,null,null,"",null,"",null,null,null,0,0,0,0,0,0,0,0,0,0,0,0,0,0,0,0,0,0,0,0,0,0,0,0,0,0,0,null,null,null,null,null,null,null,null,null,null,null,null,null,null,null,null,"",null,"",null,null,null,{"$f":"IF(BF41=\"\",\"\",(IF(BF41=\"N\",\"\",(IF(BF41=\"Y\",(IF(BN41=\"\",\"\",(IF($BN41<3,1,(IF($BN41<4,2,3))))*1.05)))))))","v":""},"",null,"",null,"",null,"",null,"","","","","","","","","","","","","","","","",""]
[null,null,null,null,"Acacia retinodes",null,null,null,null,null,null,null,null,null,null,null,null,null,null,null,null,"",null,"",null,null,null,0,0,0,0,0,0,0,0,0,0,0,0,0,0,0,0,0,0,0,0,0,0,0,0,0,0,0,null,null,null,null,null,null,null,null,null,null,null,null,null,null,null,null,"",null,"",null,null,null,{"$f":"IF(BF42=\"\",\"\",(IF(BF42=\"N\",\"\",(IF(BF42=\"Y\",(IF(BN42=\"\",\"\",(IF($BN42<2.7,1,(IF($BN42<5.5,2,3))))*1.05)))))))","v":""},"",null,"",null,"",null,"",null,"","","","","","","","","","","","","","","","",""]
[null,null,null,null,"Acacia salicina",null,null,null,null,null,null,null,null,null,null,null,null,null,null,null,null,"",null,"",null,null,null,0,0,0,0,0,0,0,0,0,0,0,0,0,0,0,0,0,0,0,0,0,0,0,0,0,0,0,null,null,null,null,null,null,null,null,null,null,null,null,null,null,null,null,"",null,"",null,null,null,{"$f":"IF(BF43=\"\",\"\",(IF(BF43=\"N\",\"\",(IF(BF43=\"Y\",(IF(BN43=\"\",\"\",(IF($BN43<3,1,(IF($BN43<5,2,3))))*1.05)))))))","v":""},"",null,"",null,"",null,"",null,"","","","","","","","","","","","","","","","",""]
[null,null,null,"Arid Areas","Acacia salicina",null,null,null,null,null,null,null,null,null,null,null,null,null,null,null,null,"",null,"",null,null,null,0,0,0,0,0,0,0,0,0,0,0,0,0,0,0,0,0,0,0,0,0,0,0,0,0,0,0,null,null,null,null,null,null,null,null,null,null,null,null,null,null,null,null,"",null,"",null,null,null,{"$f":"IF(BF44=\"\",\"\",(IF(BF44=\"N\",\"\",(IF(BF44=\"Y\",(IF(BN44=\"\",\"\",(IF($BN44<3,1,(IF($BN44<6,2,3))))*1.05)))))))","v":""},"",null,"",null,"",null,"",null,"","","","","","","","","","","","","","","","",""]
[null,null,null,"Arid Areas (Badman 21/11/03)","Acacia stenophylla",null,null,null,null,null,null,null,null,null,null,null,null,null,null,null,null,"",null,"",null,null,null,0,0,0,0,0,0,0,0,0,0,0,0,0,0,0,0,0,0,0,0,0,0,0,0,0,0,0,null,null,null,null,null,null,null,null,null,null,null,null,null,null,null,null,"",null,"",null,null,null,{"$f":"IF(BF45=\"\",\"\",(IF(BF45=\"N\",\"\",(IF(BF45=\"Y\",(IF(BN45=\"\",\"\",(IF($BN45<4,1,(IF($BN45<5.5,2,3))))*1.05)))))))","v":""},"",null,"",null,"",null,"",null,"","","","","","","","","","","","","","","","",""]
[null,null,null,"Arid Areas (Badman 21/11/03)","Acacia stowardii",null,null,null,null,null,null,null,null,null,null,null,null,null,null,null,null,"",null,"",null,null,null,0,0,0,0,0,0,0,0,0,0,0,0,0,0,0,0,0,0,0,0,0,0,0,0,0,0,0,null,null,null,null,null,null,null,null,null,null,null,null,null,null,null,null,"",null,"",null,null,null,{"$f":"IF(BF46=\"\",\"\",(IF(BF46=\"N\",\"\",(IF(BF46=\"Y\",(IF(BN46=\"\",\"\",(IF($BN46<2,1,(IF($BN46<2.5,2,3))))*1.05)))))))","v":""},"",null,"",null,"",null,"",null,"","","","","","","","","","","","","","","","",""]
[null,null,null,"Arid Areas (Badman 21/11/03)","Acacia tarculensis",null,null,null,null,null,null,null,null,null,null,null,null,null,null,null,null,"",null,"",null,null,null,0,0,0,0,0,0,0,0,0,0,0,0,0,0,0,0,0,0,0,0,0,0,0,0,0,0,0,null,null,null,null,null,null,null,null,null,null,null,null,null,null,null,null,"",null,"",null,null,null,{"$f":"IF(BF47=\"\",\"\",(IF(BF47=\"N\",\"\",(IF(BF47=\"Y\",(IF(BN47=\"\",\"\",(IF($BN47<2,1,(IF($BN47<2.5,2,3))))*1.05)))))))","v":""},"",null,"",null,"",null,"",null,"","","","","","","","","","","","","","","","",""]
[null,null,null,null,"Acacia tetragonophylla",null,null,null,null,null,null,null,null,null,null,null,null,null,null,null,null,"",null,"",null,null,null,0,0,0,0,0,0,0,0,0,0,0,0,0,0,0,0,0,0,0,0,0,0,0,0,0,0,0,null,null,null,null,null,null,null,null,null,null,null,null,null,null,null,null,"",null,"",null,null,null,{"$f":"IF(BF48=\"\",\"\",(IF(BF48=\"N\",\"\",(IF(BF48=\"Y\",(IF(BN48=\"\",\"\",(IF($BN48<2.5,1,(IF($BN48<4,2,3))))*1.05)))))))","v":""},"",null,"",null,"",null,"",null,"","","","","","","","","","","","","","","","",""]
[null,null,null,"Arid Areas","Acacia tetragonophylla",null,null,null,null,null,null,null,null,null,null,null,null,null,null,null,null,{"$f":"IF(BF49=\"\",\"\",(IF(U49=\"\",\"\",(IF(BF49=\"N\",\"\",(IF(BF49=\"Y\",U49)))))))","v":""},null,{"$f":"IF(V49=\"\",\"\",(IF(BF49=\"N\",\"\",((V49*W49)/10000))))","v":""},null,null,null,0,0,0,0,0,0,0,0,0,0,0,0,0,0,0,0,0,0,0,0,0,0,0,0,0,0,0,null,null,null,null,null,null,null,null,null,null,null,null,null,null,null,null,{"$f":"IF(BK49=\"\",\"\",(BK49*12))","v":""},null,"",null,null,null,{"$f":"IF(BF49=\"\",\"\",(IF(BF49=\"N\",\"\",(IF(BF49=\"Y\",(IF(BN49=\"\",\"\",(IF($BN49<2,1,(IF($BN49<5,2,3))))*1.05)))))))","v":""},"",null,"",null,"",null,"",null,"","","","","",{"$f":"IF(BF49=\"\",\"\",(IF(BF49=\"N\",\"\",(IF(T49=\"Y\",\"Y\",(IF(AA49=\"\",\"Y\",(IF(AA49=0,\"\",(IF(BF49=\"Y\",(AB49+AC49+AE49+AF49+AH49+AI49))))))))))))","v":""},{"$f":"IF(BG49=\"\",\"\",(IF(BG49=\"N\",\"\",(IF(BF49=\"Y\",\"\",(IF(Q49=\"Y\",\"\",(IF(BG49=\"Y\",(AW49+AY49+AZ49+BB49))))))))))","v":""},{"$f":"(IF(BF49=\"Y\",\"\",(IF(BG49=\"Y\",\"\",(IF(AL49>0,\"\",(IF(T49=\"Y\",\"Y\",(IF(AA49=\"\",\"\",(IF(AJ49>0,BI49,(IF(AK49>0,BI49,(AM49+AN49+AR49+AS49+AU49+AV49+AP49+AQ49)))))))))))))))","v":""},{"$f":"(IF(AA49=\"\",\"\",(IF(M49=\"\",\"\",(IF(Q49=\"Y\",\"\",(IF(BG49=\"N\",\"\",(IF(BF49=\"Y\",\"\",(IF(BG49=\"Y\",(AX49+BA49)))))))))))))","v":""},"",{"$f":"IF(AA49=\"\",\"\",(IF(Q49=\"Y\",\"\",(IF(AR49=0,\"\",(AR49))))))","v":""},{"$f":"IF(AO49=0,\"\",(IF(Q49=\"Y\",\"\",(AO49*2))))","v":""},{"$f":"IF(AM49=0,\"\",(IF(Q49=\"Y\",\"\",(AM49*2))))","v":""},"","",{"$f":"IF(BN49=\"\",\"\",(IF(S49=\"Y\",\"\",(IF(R49=\"Y\",\"\",(IF(Q49=\"Y\",\"\",(IF(T49=\"Y\",\"\",(IF(BF49=\"\",\"\",(IF(BF49=\"N\",\"\",(CL49))))))))))))))","v":""},""]
[null,null,null,null,"Acacia victoriae",null,null,null,null,null,null,null,null,null,null,null,null,null,null,null,null,"",null,"",null,null,null,0,0,0,0,0,0,0,0,0,0,0,0,0,0,0,0,0,0,0,0,0,0,0,0,0,0,0,null,null,null,null,null,null,null,null,null,null,null,null,null,null,null,null,"",null,{"$f":"(IF(BT50=\"\",\"\",((BT50*50)^0.42)*0.64))","v":""},null,null,null,{"$f":"IF(BF50=\"\",\"\",(IF(BF50=\"N\",\"\",(IF(BF50=\"Y\",(IF(BN50=\"\",\"\",(IF($BN50<2.5,1,(IF($BN50<3.5,2,3))))*1.05)))))))","v":""},"",null,{"$f":"IF(CA50=\"\",\"\",(IF(BF50=\"N\",\"\",(IF(BF50=\"Y\",(CA50*1.45))))))","v":""},null,{"$f":"IF(CC50=\"\",\"\",(IF(BF50=\"N\",\"\",(IF(BF50=\"Y\",(CC50*0.65))))))","v":""},null,{"$f":"IF(CE50=\"\",\"\",(IF(BF50=\"N\",\"\",(IF(BF50=\"Y\",(CE50*0.4))))))","v":""},null,{"$f":"IF(CG50=\"\",\"\",(IF(BF50=\"N\",\"\",(IF(BF50=\"Y\",(CG50*0.35))))))","v":""},{"$f":"IF(BY50=\"\",\"\",(SUM(BY50,BZ50,CB50,CD50,CF50,CH50)*SUM(BY50,BZ50,CB50,CD50,CF50,CH50)*SUM(BY50,BZ50,CB50,CD50,CF50,CH50)/55.5))","v":""},{"$f":"IF(CI50=\"\",\"\",IF(CI50<30,0,(IF(CI50>=30,1))))","v":""},{"$f":"IF(CI50=\"\",\"\",(IF(CJ50=1,CJ50=\"@\",(IF(CJ50=0,(IF($CI50<20,4*$CI50/550,(IF($CI50<30,6*$CI50/550,(IF($CI50<41,8*$CI50/550,(IF($CI50<61,10*$CI50/550,12*$CI50/550)))))))))))))","v":""},"","","","","","","","","","","","",""]
[null,null,null,"Arid Areas","Acacia victoriae",null,null,null,null,null,null,null,null,null,null,null,null,null,null,null,null,"",null,"",null,null,null,0,0,0,0,0,0,0,0,0,0,0,0,0,0,0,0,0,0,0,0,0,0,0,0,0,0,0,null,null,null,null,null,null,null,null,null,null,null,null,null,null,null,null,"",null,"",null,null,null,{"$f":"IF(BF51=\"\",\"\",(IF(BF51=\"N\",\"\",(IF(BF51=\"Y\",(IF(BN51=\"\",\"\",(IF($BN51<2,1,(IF($BN51<4,2,3))))*1.05)))))))","v":""},{"$f":"IF(BV51=\"\",\"\",(IF(BF51=\"N\",\"\",(IF(BF51=\"Y\",((100-$BV51)*0.04)+2)))))","v":""},null,"",null,"",null,"",null,"","","","","","","","","","","","","","","","",""]
[null,null,null,null,"Alectryon oleifolius",null,null,null,null,null,null,null,null,null,null,null,null,null,null,null,null,"",null,"",null,null,null,0,0,0,0,0,0,0,0,0,0,0,0,0,0,0,0,0,0,0,0,0,0,0,0,0,0,0,null,null,null,null,null,null,null,null,null,null,null,null,null,null,null,null,"",null,"",null,null,null,{"$f":"IF(BF52=\"\",\"\",(IF(BF52=\"N\",\"\",(IF(BF52=\"Y\",(IF(BN52=\"\",\"\",(IF($BN52<2.5,1,(IF($BN52<4,2,3))))*1.05)))))))","v":""},"",null,"",null,"",null,"",null,"","","","","","","","","","","","","","","","",""]
[null,null,null,"Arid Areas","Alectryon oleifolius",null,null,null,null,null,null,null,null,null,null,null,null,null,null,null,null,"",null,"",null,null,null,0,0,0,0,0,0,0,0,0,0,0,0,0,0,0,0,0,0,0,0,0,0,0,0,0,0,0,null,null,null,null,null,null,null,null,null,null,null,null,null,null,null,null,"",null,"",null,null,null,{"$f":"IF(BF53=\"\",\"\",(IF(BF53=\"N\",\"\",(IF(BF53=\"Y\",(IF(BN53=\"\",\"\",(IF($BN53<2.5,1,(IF($BN53<5,2,3))))*1.05)))))))","v":""},"",null,"",null,"",null,"",null,"","","","","","","","","","","","","","","","",""]
[null,null,null,null,"Allocasuarina luehmannii",null,null,null,null,null,null,null,null,null,null,null,null,null,null,null,null,"",null,"",null,null,null,0,0,0,0,0,0,0,0,0,0,0,0,0,0,0,0,0,0,0,0,0,0,0,0,0,0,0,null,null,null,null,null,null,null,null,null,null,null,null,null,null,null,null,"",null,"",null,null,null,{"$f":"IF(BF54=\"\",\"\",(IF(BF54=\"N\",\"\",(IF(BF54=\"Y\",(IF(BN54=\"\",\"\",(IF($BN54<4,1,(IF($BN54<8,2,3))))*1.05)))))))","v":""},"",null,"",null,"",null,"",null,"","","","","","","","","","","","","","","","",""]
[null,null,null,null,"Allocasuarina mackliniana",null,null,null,null,null,null,null,null,null,null,null,null,null,null,null,null,"",null,"",null,null,null,0,0,0,0,0,0,0,0,0,0,0,0,0,0,0,0,0,0,0,0,0,0,0,0,0,0,0,null,null,null,null,null,null,null,null,null,null,null,null,null,null,null,null,"",null,"",null,null,null,{"$f":"IF(BF55=\"\",\"\",(IF(BF55=\"N\",\"\",(IF(BF55=\"Y\",(IF(BN55=\"\",\"\",(IF($BN55<1,1,(IF($BN55<1.5,2,3))))*1.05)))))))","v":""},"",null,"",null,"",null,"",null,"","","","","","","","","","","","","","","","",""]
[null,null,null,null,"Allocasuarina verticillata",null,null,null,null,null,null,null,null,null,null,null,null,null,null,null,null,"",null,"",null,null,null,0,0,0,0,0,0,0,0,0,0,0,0,0,0,0,0,0,0,0,0,0,0,0,0,0,0,0,null,null,null,null,null,null,null,null,null,null,null,null,null,null,null,null,"",null,"",null,null,null,{"$f":"IF(BF56=\"\",\"\",(IF(BF56=\"N\",\"\",(IF(BF56=\"Y\",(IF(BN56=\"\",\"\",(IF($BN56<4,1,(IF($BN56<8,2,3))))*1.05)))))))","v":""},"",null,"",null,"",null,"",null,"","","","","","","","","","","","","","","","",""]
[null,null,null,"Arid Areas (Badman 21/11/03)","Atalaya hemiglauca",null,null,null,null,null,null,null,null,null,null,null,null,null,null,null,null,"",null,"",null,null,null,0,0,0,0,0,0,0,0,0,0,0,0,0,0,0,0,0,0,0,0,0,0,0,0,0,0,0,null,null,null,null,null,null,null,null,null,null,null,null,null,null,null,null,"",null,"",null,null,null,{"$f":"IF(BF57=\"\",\"\",(IF(BF57=\"N\",\"\",(IF(BF57=\"Y\",(IF(BN57=\"\",\"\",(IF($BN57<3,1,(IF($BN57<4,2,3))))*1.05)))))))","v":""},"",null,"",null,"",null,"",null,"","","","","","","","","","","","","","","","",""]
[null,null,null,"tree form, higher rainfall, sandy loan flats. As plant community or understorey in Euc. Woodland","Banksia marginata",null,null,null,null,null,null,null,null,null,null,null,null,null,null,null,null,"",null,"",null,null,null,0,0,0,0,0,0,0,0,0,0,0,0,0,0,0,0,0,0,0,0,0,0,0,0,0,0,0,null,null,null,null,null,null,null,null,null,null,null,null,null,null,null,null,"",null,"",null,null,null,{"$f":"IF(BF58=\"\",\"\",(IF(BF58=\"N\",\"\",(IF(BF58=\"Y\",(IF(BN58=\"\",\"\",(IF($BN58<3,1,(IF($BN58<6,2,3))))*1.05)))))))","v":""},"",null,"",null,"",null,"",null,"","","","","","","","","","","","","","","","",""]
[null,null,null,"shrub on deep sand, heath","Banksia marginata",null,null,null,null,null,null,null,null,null,null,null,null,null,null,null,null,"",null,"",null,null,null,0,0,0,0,0,0,0,0,0,0,0,0,0,0,0,0,0,0,0,0,0,0,0,0,0,0,0,null,null,null,null,null,null,null,null,null,null,null,null,null,null,null,null,"",null,"",null,null,null,{"$f":"IF(BF59=\"\",\"\",(IF(BF59=\"N\",\"\",(IF(BF59=\"Y\",(IF(BN59=\"\",\"\",(IF($BN59<1,1,(IF($BN59<2,2,3))))*1.05)))))))","v":""},"",null,"",null,"",null,"",null,"","","","","","","","","","","","","","","","",""]
[null,null,null,"tree form","Bursaria spinosa",null,null,null,null,null,null,null,null,null,null,null,null,null,null,null,null,"",null,"",null,null,null,0,0,0,0,0,0,0,0,0,0,0,0,0,0,0,0,0,0,0,0,0,0,0,0,0,0,0,null,null,null,null,null,null,null,null,null,null,null,null,null,null,null,null,"",null,"",null,null,null,{"$f":"IF(BF60=\"\",\"\",(IF(BF60=\"N\",\"\",(IF(BF60=\"Y\",(IF(BN60=\"\",\"\",(IF($BN60<2,1,(IF($BN60<3,2,3))))*1.05)))))))","v":""},"",null,"",null,"",null,"",null,"","","","","","","","","","","","","","","","",""]
[null,null,null,"shrub form","Bursaria spinosa",null,null,null,null,null,null,null,null,null,null,null,null,null,null,null,null,"",null,"",null,null,null,0,0,0,0,0,0,0,0,0,0,0,0,0,0,0,0,0,0,0,0,0,0,0,0,0,0,0,null,null,null,null,null,null,null,null,null,null,null,null,null,null,null,null,"",null,"",null,null,null,{"$f":"IF(BF61=\"\",\"\",(IF(BF61=\"N\",\"\",(IF(BF61=\"Y\",(IF(BN61=\"\",\"\",(IF($BN61<0.5,1,(IF($BN61<1,2,3))))*1.05)))))))","v":""},"",null,"",null,"",null,"",null,"","","","","","","","","","","","","","","","",""]
[null,null,null,null,"Callistemon rugulosus",null,null,null,null,null,null,null,null,null,null,null,null,null,null,null,null,"",null,"",null,null,null,0,0,0,0,0,0,0,0,0,0,0,0,0,0,0,0,0,0,0,0,0,0,0,0,0,0,0,null,null,null,null,null,null,null,null,null,null,null,null,null,null,null,null,"",null,"",null,null,null,{"$f":"IF(BF62=\"\",\"\",(IF(BF62=\"N\",\"\",(IF(BF62=\"Y\",(IF(BN62=\"\",\"\",(IF($BN62<1,1,(IF($BN62<2,2,3))))*1.05)))))))","v":""},"",null,"",null,"",null,"",null,"","","","","","","","","","","","","","","","",""]
[null,null,null,"Arid Areas (Badman 21/11/03)","Callitris glaucophylla",null,null,null,null,null,null,null,null,null,null,null,null,null,null,null,null,"",null,"",null,null,null,0,0,0,0,0,0,0,0,0,0,0,0,0,0,0,0,0,0,0,0,0,0,0,0,0,0,0,null,null,null,null,null,null,null,null,null,null,null,null,null,null,null,null,"",null,"",null,null,null,{"$f":"IF(BF63=\"\",\"\",(IF(BF63=\"N\",\"\",(IF(BF63=\"Y\",(IF(BN63=\"\",\"\",(IF($BN63<4,1,(IF($BN63<7,2,3))))*1.05)))))))","v":""},"",null,"",null,"",null,"",null,"","","","","","","","","","","","","","","","",""]
[null,null,null,null,"Callitris gracilis",null,null,null,null,null,null,null,null,null,null,null,null,null,null,null,null,"",null,"",null,null,null,0,0,0,0,0,0,0,0,0,0,0,0,0,0,0,0,0,0,0,0,0,0,0,0,0,0,0,null,null,null,null,null,null,null,null,null,null,null,null,null,null,null,null,"",null,"",null,null,null,{"$f":"IF(BF64=\"\",\"\",(IF(BF64=\"N\",\"\",(IF(BF64=\"Y\",(IF(BN64=\"\",\"\",(IF($BN64<5,1,(IF($BN64<8,2,3))))*1.05)))))))","v":""},"",null,"",null,"",null,"",null,"","","","","","","","","","","","","","","","",""]
[null,null,null,"Arid Areas (Badman 21/11/03)","Canthium latifolium",null,null,null,null,null,null,null,null,null,null,null,null,null,null,null,null,"",null,"",null,null,null,0,0,0,0,0,0,0,0,0,0,0,0,0,0,0,0,0,0,0,0,0,0,0,0,0,0,0,null,null,null,null,null,null,null,null,null,null,null,null,null,null,null,null,"",null,"",null,null,null,{"$f":"IF(BF65=\"\",\"\",(IF(BF65=\"N\",\"\",(IF(BF65=\"Y\",(IF(BN65=\"\",\"\",(IF($BN65<2.5,1,(IF($BN65<3,2,3))))*1.05)))))))","v":""},"",null,"",null,"",null,"",null,"","","","","","","","","","","","","","","","",""]
[null,null,null,"Arid Areas (Badman 21/11/03)","Capparis mitchellii",null,null,null,null,null,null,null,null,null,null,null,null,null,null,null,null,"",null,"",null,null,null,0,0,0,0,0,0,0,0,0,0,0,0,0,0,0,0,0,0,0,0,0,0,0,0,0,0,0,null,null,null,null,null,null,null,null,null,null,null,null,null,null,null,null,"",null,"",null,null,null,{"$f":"IF(BF66=\"\",\"\",(IF(BF66=\"N\",\"\",(IF(BF66=\"Y\",(IF(BN66=\"\",\"\",(IF($BN66<4,1,(IF($BN66<6,2,3))))*1.05)))))))","v":""},"",null,"",null,"",null,"",null,"","","","","","","","","","","","","","","","",""]
[null,null,null,null,"Casuarina pauper",null,null,null,null,null,null,null,null,null,null,null,null,null,null,null,null,"",null,"",null,null,null,0,0,0,0,0,0,0,0,0,0,0,0,0,0,0,0,0,0,0,0,0,0,0,0,0,0,0,null,null,null,null,null,null,null,null,null,null,null,null,null,null,null,null,"",null,"",null,null,null,{"$f":"IF(BF67=\"\",\"\",(IF(BF67=\"N\",\"\",(IF(BF67=\"Y\",(IF(BN67=\"\",\"\",(IF($BN67<5,1,(IF($BN67<8,2,3))))*1.05)))))))","v":""},"",null,"",null,"",null,"",null,"","","","","","","","","","","","","","","","",""]
[null,null,null,"Arid Areas (Badman 21/11/03)","Codoncarpus cotinifolius",null,null,null,null,null,null,null,null,null,null,null,null,null,null,null,null,"",null,"",null,null,null,0,0,0,0,0,0,0,0,0,0,0,0,0,0,0,0,0,0,0,0,0,0,0,0,0,0,0,null,null,null,null,null,null,null,null,null,null,null,null,null,null,null,null,"",null,"",null,null,null,{"$f":"IF(BF68=\"\",\"\",(IF(BF68=\"N\",\"\",(IF(BF68=\"Y\",(IF(BN68=\"\",\"\",(IF($BN68<4,1,(IF($BN68<6,2,3))))*1.05)))))))","v":""},"",null,"",null,"",null,"",null,"","","","","","","","","","","","","","","","",""]
[null,null,null,"Arid Areas (Badman 21/11/03)","Corymbia eremaea ssp. eremaea",null,null,null,null,null,null,null,null,null,null,null,null,null,null,null,null,"",null,"",null,null,null,0,0,0,0,0,0,0,0,0,0,0,0,0,0,0,0,0,0,0,0,0,0,0,0,0,0,0,null,null,null,null,null,null,null,null,null,null,null,null,null,null,null,null,"",null,"",null,null,null,{"$f":"IF(BF69=\"\",\"\",(IF(BF69=\"N\",\"\",(IF(BF69=\"Y\",(IF(BN69=\"\",\"\",(IF($BN69<4,1,(IF($BN69<6,2,3))))*1.05)))))))","v":""},"",null,"",null,"",null,"",null,"","","","","","","","","","","","","","","","",""]
[null,null,null,"Arid Areas (Badman 21/11/03)","Corymbia tumescens",null,null,null,null,null,null,null,null,null,null,null,null,null,null,null,null,"",null,"",null,null,null,0,0,0,0,0,0,0,0,0,0,0,0,0,0,0,0,0,0,0,0,0,0,0,0,0,0,0,null,null,null,null,null,null,null,null,null,null,null,null,null,null,null,null,"",null,"",null,null,null,{"$f":"IF(BF70=\"\",\"\",(IF(BF70=\"N\",\"\",(IF(BF70=\"Y\",(IF(BN70=\"\",\"\",(IF($BN70<4,1,(IF($BN70<6,2,3))))*1.05)))))))","v":""},"",null,"",null,"",null,"",null,"","","","","","","","","","","","","","","","",""]
[null,null,null,null,"Dodonaea viscosa ssp angustissima",null,null,null,null,null,null,null,null,null,null,null,null,null,null,null,null,"",null,"",null,null,null,0,0,0,0,0,0,0,0,0,0,0,0,0,0,0,0,0,0,0,0,0,0,0,0,0,0,0,null,null,null,null,null,null,null,null,null,null,null,null,null,null,null,null,"",null,"",null,null,null,{"$f":"IF(BF71=\"\",\"\",(IF(BF71=\"N\",\"\",(IF(BF71=\"Y\",(IF(BN71=\"\",\"\",(IF($BN71<1,1,(IF($BN71<3,2,3))))*1.05)))))))","v":""},"",null,"",null,"",null,"",null,"","","","","","","","","","","","","","","","",""]
[null,null,null,"Arid Areas (Badman 21/11/03)","Eremophila bignoniiflora",null,null,null,null,null,null,null,null,null,null,null,null,null,null,null,null,"",null,"",null,null,null,0,0,0,0,0,0,0,0,0,0,0,0,0,0,0,0,0,0,0,0,0,0,0,0,0,0,0,null,null,null,null,null,null,null,null,null,null,null,null,null,null,null,null,"",null,"",null,null,null,{"$f":"IF(BF72=\"\",\"\",(IF(BF72=\"N\",\"\",(IF(BF72=\"Y\",(IF(BN72=\"\",\"\",(IF($BN72<2.5,1,(IF($BN72<3,2,3))))*1.05)))))))","v":""},"",null,"",null,"",null,"",null,"","","","",{"$f":"IF(CI72=\"\",\"\",((IF($CI72<20,4*$CI72/550,(IF($CI72<29.1,6*$CI72/550,(IF($CI72<40.1,8*$CI72/550,(IF($CI72<60.1,10*$CI72/550,12*$CI72/550))))))))*AA72))","v":""},"","","","","","","","","","","",""]
[null,null,null,null,"Eremophila deserti",null,null,null,null,null,null,null,null,null,null,null,null,null,null,null,null,"",null,"",null,null,null,0,0,0,0,0,0,0,0,0,0,0,0,0,0,0,0,0,0,0,0,0,0,0,0,0,0,0,null,null,null,null,null,null,null,null,null,null,null,null,null,null,null,null,"",null,"",null,null,null,{"$f":"IF(BF73=\"\",\"\",(IF(BF73=\"N\",\"\",(IF(BF73=\"Y\",(IF(BN73=\"\",\"\",(IF($BN73<2,1,(IF($BN73<3,2,3))))*1.05)))))))","v":""},"",null,"",null,"",null,"",null,"","","","","","","","","","","","","","","","",""]
[null,null,null,"Arid Areas","Eremophila deserti",null,null,null,null,null,null,null,null,null,null,null,null,null,null,null,null,"",null,"",null,null,null,0,0,0,0,0,0,0,0,0,0,0,0,0,0,0,0,0,0,0,0,0,0,0,0,0,0,0,null,null,null,null,null,null,null,null,null,null,null,null,null,null,null,null,"",null,"",null,null,null,{"$f":"IF(BF74=\"\",\"\",(IF(BF74=\"N\",\"\",(IF(BF74=\"Y\",(IF(BN74=\"\",\"\",(IF($BN74<1,1,(IF($BN74<4,2,3))))*1.05)))))))","v":""},"",null,"",null,"",null,"",null,"","","","","","","","","","","","","","","","",""]
[null,null,null,null,"Eremophila duttonii",null,null,null,null,null,null,null,null,null,null,null,null,null,null,null,null,"",null,"",null,null,null,0,0,0,0,0,0,0,0,0,0,0,0,0,0,0,0,0,0,0,0,0,0,0,0,0,0,0,null,null,null,null,null,null,null,null,null,null,null,null,null,null,null,null,"",null,"",null,null,null,{"$f":"IF(BF75=\"\",\"\",(IF(BF75=\"N\",\"\",(IF(BF75=\"Y\",(IF(BN75=\"\",\"\",(IF($BN75<2,1,(IF($BN75<3,2,3))))*1.05)))))))","v":""},"",null,"",null,"",null,"",null,"","","","","","","","","","","","","","","","",""]
[null,null,null,"Arid Areas","Eremophila duttonii",null,null,null,null,null,null,null,null,null,null,null,null,null,null,null,null,"",null,"",null,null,null,0,0,0,0,0,0,0,0,0,0,0,0,0,0,0,0,0,0,0,0,0,0,0,0,0,0,0,null,null,null,null,null,null,null,null,null,null,null,null,null,null,null,null,"",null,"",null,null,null,{"$f":"IF(BF76=\"\",\"\",(IF(BF76=\"N\",\"\",(IF(BF76=\"Y\",(IF(BN76=\"\",\"\",(IF($BN76<1,1,(IF($BN76<3.5,2,3))))*1.05)))))))","v":""},"",null,"",null,"",null,"",null,"","","","","","","","","","","","","","","","",""]
[null,null,null,null,"Eremophila freelingii",null,null,null,null,null,null,null,null,null,null,null,null,null,null,null,null,"",null,"",null,null,null,0,0,0,0,0,0,0,0,0,0,0,0,0,0,0,0,0,0,0,0,0,0,0,0,0,0,0,null,null,null,null,null,null,null,null,null,null,null,null,null,null,null,null,"",null,"",null,null,null,{"$f":"IF(BF77=\"\",\"\",(IF(BF77=\"N\",\"\",(IF(BF77=\"Y\",(IF(BN77=\"\",\"\",(IF($BN77<2,1,(IF($BN77<2.5,2,3))))*1.05)))))))","v":""},"",null,"",null,"",null,"",null,"","","","","","","","","","","","","","","","",""]
[null,null,null,"Arid Areas","Eremophila freelingii",null,null,null,null,null,null,null,null,null,null,null,null,null,null,null,null,"",null,"",null,null,null,0,0,0,0,0,0,0,0,0,0,0,0,0,0,0,0,0,0,0,0,0,0,0,0,0,0,0,null,null,null,null,null,null,null,null,null,null,null,null,null,null,null,null,"",null,"",null,null,null,{"$f":"IF(BF78=\"\",\"\",(IF(BF78=\"N\",\"\",(IF(BF78=\"Y\",(IF(BN78=\"\",\"\",(IF($BN78<1,1,(IF($BN78<3,2,3))))*1.05)))))))","v":""},"",null,"",null,"",null,"",null,"","","","","","","","","","","","","","","","",""]
[null,null,null,"Arid Areas (Badman 21/11/03)","Eremophila latrobei",null,null,null,null,null,null,null,null,null,null,null,null,null,null,null,null,"",null,"",null,null,null,0,0,0,0,0,0,0,0,0,0,0,0,0,0,0,0,0,0,0,0,0,0,0,0,0,0,0,null,null,null,null,null,null,null,null,null,null,null,null,null,null,null,null,"",null,"",null,null,null,{"$f":"IF(BF79=\"\",\"\",(IF(BF79=\"N\",\"\",(IF(BF79=\"Y\",(IF(BN79=\"\",\"\",(IF($BN79<2.5,1,(IF($BN79<3,2,3))))*1.05)))))))","v":""},"",null,"",null,"",null,"",null,"","","","","","","","","","","","","","","","",""]
[null,null,null,null,"Eremophila longifolia",null,null,null,null,null,null,null,null,null,null,null,null,null,null,null,null,"",null,"",null,null,null,0,0,0,0,0,0,0,0,0,0,0,0,0,0,0,0,0,0,0,0,0,0,0,0,0,0,0,null,null,null,null,null,null,null,null,null,null,null,null,null,null,null,null,"",null,"",null,null,null,{"$f":"IF(BF80=\"\",\"\",(IF(BF80=\"N\",\"\",(IF(BF80=\"Y\",(IF(BN80=\"\",\"\",(IF($BN80<3,1,(IF($BN80<6,2,3))))*1.05)))))))","v":""},"",null,"",null,"",null,"",null,"","","","","","","","","","","","","","","","",""]
[null,null,null,"Arid Areas","Eremophila longifolia",null,null,null,null,null,null,null,null,null,null,null,null,null,null,null,null,{"$f":"IF(BF81=\"\",\"\",(IF(U81=\"\",\"\",(IF(BF81=\"N\",\"\",(IF(BF81=\"Y\",U81)))))))","v":""},null,{"$f":"IF(V81=\"\",\"\",(IF(BF81=\"N\",\"\",((V81*W81)/10000))))","v":""},null,null,null,{"$f":"IF(M81=\"\",0,(IF(T81=\"\",0,(IF(T81=\"Y\",0,(IF(S81=\"Y\",0, (IF(R81=\"Y\",0,(IF(BF81=\"N\",0,(IF(M81=\"P\",AA81)))))))))))))","v":0},{"$f":"IF(N81=\"\",0,(IF(T81=\"\",0,(IF(T81=\"Y\",0,(IF(S81=\"Y\",0, (IF(R81=\"Y\",0,(IF(BF81=\"N\",0,(IF(N81=\"P\",AA81)))))))))))))","v":0},{"$f":"IF(M81=\"\",0,(IF(T81=\"\",0,(IF(T81=\"N\",0,(IF(S81=\"Y\",0,(IF(BF81=\"N\",0,(IF(T81=\"Y\",(X81))))))))))))","v":0},{"$f":"IF(M81=\"\",0,(IF(T81=\"\",0,(IF(T81=\"Y\",0,(IF(S81=\"N\",0,(IF(BF81=\"N\",0,(IF(M81=\"P\",AA81)))))))))))","v":0},{"$f":"IF(N81=\"\",0,(IF(T81=\"\",0,(IF(T81=\"Y\",0,(IF(S81=\"N\",0, (IF(BF81=\"N\",0,(IF(N81=\"P\",AA81)))))))))))","v":0},{"$f":"IF(M81=\"\",0,(IF(T81=\"\",0,(IF(S81=\"N\",0,(IF(BF81=\"N\",0,(IF(T81=\"N\",0,(IF(T81=\"Y\",U81)))))))))))","v":0},{"$f":"IF(M81=\"\",0,(IF(T81=\"\",0,(IF(T81=\"Y\",0,(IF(S81=\"Y\",0,(IF(R81=\"N\",0,(IF(BF81=\"N\",0,(IF(M81=\"P\",AA81)))))))))))))","v":0},{"$f":"IF(N81=\"\",0,(IF(T81=\"\",0,(IF(T81=\"Y\",0,(IF(R81=\"N\",0, (IF(BF81=\"N\",0,(IF(N81=\"P\",AA81)))))))))))","v":0},{"$f":"IF(M81=\"\",0,(IF(BC81=\"N\",0,(IF(BD81=\"Y\",0,(IF(T81=\"Y\",0,(IF(BC81=\"E\",AA81,(IF(BC81=\"D\",AA81,(IF(BC81=\"O\",AA81,(IF(BC81=\"M\",AA81)))))))))))))))","v":0},{"$f":"IF(N81=\"\",0,(IF(BH81>0,0,(IF(BC81=\"N\",0,(IF(BD81=\"Y\",0,(IF(T81=\"Y\",0,(IF(BC81=\"E\",AA81,(IF(BC81=\"D\",AA81,(IF(BC81=\"O\",AA81,(IF(BC81=\"M\",AA81)))))))))))))))))","v":0},{"$f":"IF(M81=\"\",0,(IF(U81=\"\",0,(IF(BC81=\"N\",0,(IF(BD81=\"Y\",0,IF(T81=\"N\",0,(IF(BC81=\"E\",U81,(IF(BC81=\"D\",U81,(IF(BC81=\"O\",U81,(IF(BC81=\"M\",U81))))))))))))))))","v":0},{"$f":"(IF(M81=\"\",0,(IF(BE81=\"N\",0,(IF(BF81=\"Y\",0,(IF(BI81=0,0,(IF(BI81=\"\",\"\",(IF(Q81=\"Y\",0,(IF(R81=\"Y\",0,(IF(T81=\"Y\",0,(IF(BE81=\"Y\",AA81))))))))))))))))))","v":0},{"$f":"IF(N81=\"\",0,(IF(BE81=\"N\",0,(IF(BF81=\"Y\",0,(IF(BI81=0,0,(IF(BI81=\"\",0,(IF(Q81=\"Y\",0,(IF(R81=\"Y\",0,(IF(T81=\"Y\",0,(IF(BE81=\"Y\",AA81)))))))))))))))))","v":0},{"$f":"IF(M81=\"\",0,(IF(U81=\"\",0,(IF(T81=\"N\",0,(IF(BE81=\"N\",0,(IF(BF81=\"Y\",0,(IF(BE81=\"Y\",U81)))))))))))","v":0},{"$f":"(IF(M81=\"\",0,(IF(T81=\"Y\",0,(IF(S81=\"Y\",0,(IF(BD81=\"Y\",0,(IF(BE81=\"N\",0,(IF(BF81=\"Y\",0,(IF(BI81=0,0,(IF(BI81=\"\",\"\",(IF(R81=\"N\",0,(IF(R81=\"Y\",AA81))))))))))))))))))))+(IF(M81=\"\",0,(IF(R81=\"Y\",0,(IF(T81=\"Y\",0,(IF(S81=\"Y\",0,(IF(BD81=\"Y\",0,(IF(BE81=\"N\",0,(IF(BF81=\"Y\",0,(IF(BI81=0,0,(IF(BI81=\"\",\"\",(IF(Q81=\"Y\",AA81))))))))))))))))))))","v":0},{"$f":"(IF(N81=\"\",0,(IF(T81=\"\",0,(IF(T81=\"Y\",0,(IF(R81=\"N\",0, (IF(BF81=\"Y\",0,(IF(BE81=\"N\",0,(IF(BI81=0,0,(IF(BI81=\"\",\"\",(IF(R81=\"Y\",AA81))))))))))))))))))+(IF(N81=\"\",0,(IF(T81=\"\",0,(IF(T81=\"Y\",0,(IF(R81=\"Y\",0, (IF(BF81=\"Y\",0,(IF(BE81=\"N\",0,(IF(BI81=0,0,(IF(BI81=\"\",\"\",(IF(Q81=\"Y\",AA81))))))))))))))))))","v":0},{"$f":"(IF(M81=\"\",0,(IF(T81=\"Y\",0,(IF(BG81=\"Y\",0,(IF(BD81=\"N\",0,(IF(Q81=\"Y\",0,(IF(R81=\"Y\",0,(IF(BD81=\"Y\",AA81))))))))))))))","v":0},{"$f":"IF(N81=\"\",0,(IF(BD81=\"\",0,(IF(BD81=\"N\",0,(IF(BH81>0,0,(IF(T81=\"Y\",0,(IF(R81=\"Y\",0,(IF(Q81=\"Y\",0,(IF(BD81=\"Y\",AA81)))))))))))))))","v":0},{"$f":"IF(M81=\"\",0,(IF(BD81=\"\",0,(IF(BD81=\"N\",0,(IF(T81=\"N\",0,(IF(Q81=\"Y\",0,(IF(BD81=\"Y\",U81)))))))))))","v":0},{"$f":"(IF(M81=\"\",0,(IF(T81=\"\",0,(IF(T81=\"Y\",0,(IF(S81=\"Y\",0,(IF(R81=\"N\",0,(IF(BD81=\"N\",0,(IF(BE81=\"Y\",0,(IF(R81=\"Y\",AA81))))))))))))))))+(IF(R81=\"Y\",0,(IF(M81=\"\",0,(IF(BD81=\"N\",0,(IF(T81=\"\",0,(IF(T81=\"Y\",0,(IF(S81=\"Y\",0,(IF(BE81=\"Y\",0,(IF(Q81=\"Y\",AA81))))))))))))))))","v":0},{"$f":"(IF(N81=\"\",0,(IF(T81=\"\",0,(IF(T81=\"Y\",0,(IF(R81=\"N\",0,(IF(S81=\"Y\",0,(IF(BE81=\"Y\",0,(IF(BD81=\"N\",0,(IF(R81=\"Y\",AA81))))))))))))))))+(IF(R81=\"Y\",0,(IF(N81=\"\",0,(IF(T81=\"\",0,(IF(T81=\"Y\",0,(IF(S81=\"Y\",0,(IF(BE81=\"Y\",0,(IF(BD81=\"N\",0,(IF(Q81=\"Y\",AA81))))))))))))))))","v":0},{"$f":"IF(M81=\"\",0,(IF(BF81=\"Y\",0,(IF(BH81=\"\",0,(IF(BG81=\"N\",0,(IF(BH81=\"R\",0,(IF(BH81=\"S\",AA81)))))))))))","v":0},{"$f":"(IF(AW81=0,0,AW81))*3","v":0},{"$f":"IF(N81=\"\",0,(IF(BF81=\"Y\",0,(IF(BG81=\"N\",0,(IF(BH81=\"R\",0,(IF(BH81=\"S\",AA81)))))))))","v":0},{"$f":"IF(M81=\"\",0,(IF(BF81=\"Y\",0,(IF(BG81=\"N\",0,(IF(BH81=\"\",0,(IF(BH81=\"S\",0,(IF(BH81=\"R\",AA81)))))))))))","v":0},{"$f":"(IF(AZ81=0,0,AZ81))*2","v":0},{"$f":"IF(N81=\"\",0,(IF(BF81=\"Y\",0,(IF(BG81=\"N\",0,(IF(BH81=\"S\",0,(IF(BH81=\"R\",AA81)))))))))","v":0},null,null,null,null,null,null,null,null,null,null,null,null,null,null,null,null,{"$f":"IF(BK81=\"\",\"\",(BK81*12))","v":""},null,"",null,null,null,{"$f":"IF(BF81=\"\",\"\",(IF(BF81=\"N\",\"\",(IF(BF81=\"Y\",(IF(BN81=\"\",\"\",(IF($BN81<1,1,(IF($BN81<8,2,3))))*1.05)))))))","v":""},"",null,"",null,"",null,"",null,"","","","","",{"$f":"IF(BF81=\"\",\"\",(IF(BF81=\"N\",\"\",(IF(T81=\"Y\",\"Y\",(IF(AA81=\"\",\"Y\",(IF(AA81=0,\"\",(IF(BF81=\"Y\",(AB81+AC81+AE81+AF81+AH81+AI81))))))))))))","v":""},{"$f":"IF(BG81=\"\",\"\",(IF(BG81=\"N\",\"\",(IF(BF81=\"Y\",\"\",(IF(Q81=\"Y\",\"\",(IF(BG81=\"Y\",(AW81+AY81+AZ81+BB81))))))))))","v":""},{"$f":"(IF(BF81=\"Y\",\"\",(IF(BG81=\"Y\",\"\",(IF(AL81>0,\"\",(IF(T81=\"Y\",\"Y\",(IF(AA81=\"\",\"\",(IF(AJ81>0,BI81,(IF(AK81>0,BI81,(AM81+AN81+AR81+AS81+AU81+AV81+AP81+AQ81)))))))))))))))","v":""},{"$f":"(IF(AA81=\"\",\"\",(IF(M81=\"\",\"\",(IF(Q81=\"Y\",\"\",(IF(BG81=\"N\",\"\",(IF(BF81=\"Y\",\"\",(IF(BG81=\"Y\",(AX81+BA81)))))))))))))","v":""},{"$f":"IF(AT81=0,\"\",(IF(AQ81=\"Y\",\"\",(AT81))))","v":""},{"$f":"IF(AA81=\"\",\"\",(IF(Q81=\"Y\",\"\",(IF(AR81=0,\"\",(AR81))))))","v":""},{"$f":"IF(AO81=0,\"\",(IF(Q81=\"Y\",\"\",(AO81*2))))","v":""},{"$f":"IF(AM81=0,\"\",(IF(Q81=\"Y\",\"\",(AM81*2))))","v":""},{"$f":"(IF(AE81=0,\"\",(IF(Q81=\"Y\",\"\",(AE81*2)))))","v":""},{"$f":"IF(AD81=0,\"\",(IF(Q81=\"Y\",\"\",(AD81))))","v":""},{"$f":"IF(BN81=\"\",\"\",(IF(S81=\"Y\",\"\",(IF(R81=\"Y\",\"\",(IF(Q81=\"Y\",\"\",(IF(T81=\"Y\",\"\",(IF(BF81=\"\",\"\",(IF(BF81=\"N\",\"\",(CL81))))))))))))))","v":""},""]
[null,null,null,"Arid Areas (Badman 21/11/03)","Eremophila oppositifolia",null,null,null,null,null,null,null,null,null,null,null,null,null,null,null,null,"",null,"",null,null,null,0,0,0,0,0,0,0,0,0,0,0,0,0,0,0,0,0,0,0,0,0,0,0,0,0,0,0,null,null,null,null,null,null,null,null,null,null,null,null,null,null,null,null,"",null,{"$f":"(IF(BT82=\"\",\"\",((BT82*50)^0.42)*0.64))","v":""},null,null,null,{"$f":"IF(BF82=\"\",\"\",(IF(BF82=\"N\",\"\",(IF(BF82=\"Y\",(IF(BN82=\"\",\"\",(IF($BN82<2.5,1,(IF($BN82<3,2,3))))*1.05)))))))","v":""},"",null,{"$f":"IF(CA82=\"\",\"\",(IF(BF82=\"N\",\"\",(IF(BF82=\"Y\",(CA82*1.45))))))","v":""},null,{"$f":"IF(CC82=\"\",\"\",(IF(BF82=\"N\",\"\",(IF(BF82=\"Y\",(CC82*0.65))))))","v":""},null,{"$f":"IF(CE82=\"\",\"\",(IF(BF82=\"N\",\"\",(IF(BF82=\"Y\",(CE82*0.4))))))","v":""},null,{"$f":"IF(CG82=\"\",\"\",(IF(BF82=\"N\",\"\",(IF(BF82=\"Y\",(CG82*0.35))))))","v":""},{"$f":"IF(BY82=\"\",\"\",(SUM(BY82,BZ82,CB82,CD82,CF82,CH82)*SUM(BY82,BZ82,CB82,CD82,CF82,CH82)*SUM(BY82,BZ82,CB82,CD82,CF82,CH82)/55.5))","v":""},{"$f":"IF(CI82=\"\",\"\",IF(CI82<30,0,(IF(CI82>=30,1))))","v":""},{"$f":"IF(CI82=\"\",\"\",(IF(CJ82=1,CJ82=\"@\",(IF(CJ82=0,(IF($CI82<20,4*$CI82/550,(IF($CI82<30,6*$CI82/550,(IF($CI82<41,8*$CI82/550,(IF($CI82<61,10*$CI82/550,12*$CI82/550)))))))))))))","v":""},"","","","","","","","","","","","",""]
[null,null,null,null,"Eremophila scoparia",null,null,null,null,null,null,null,null,null,null,null,null,null,null,null,null,"",null,"",null,null,null,0,0,0,0,0,0,0,0,0,0,0,0,0,0,0,0,0,0,0,0,0,0,0,0,0,0,0,null,null,null,null,null,null,null,null,null,null,null,null,null,null,null,null,"",null,"",null,null,null,{"$f":"IF(BF83=\"\",\"\",(IF(BF83=\"N\",\"\",(IF(BF83=\"Y\",(IF(BN83=\"\",\"\",(IF($BN83<2,1,(IF($BN83<2.5,2,3))))*1.05)))))))","v":""},{"$f":"IF(BV83=\"\",\"\",(IF(BF83=\"N\",\"\",(IF(BF83=\"Y\",((100-$BV83)*0.04)+2)))))","v":""},null,"",null,"",null,"",null,"","","","","","","","","","","","","","","","",{"$f":"IF(BF83=\"\",\"\",(IF(BF83=\"N\",\"\",(IF(BP83=\"\",\"\",(IF(R83=\"Y\",\"\",(IF(T83=\"Y\",\"\",(IF($CY$6=\"\",\"\",(IF(AA83=\"\",\"\",(PI()*((BP83/2)*(BP83/2)))/10000*AA83)))))))))))))","v":""}]
[null,null,null,"Arid Areas","Eremophila scoparia",null,null,null,null,null,null,null,null,null,null,null,null,null,null,null,null,"",null,"",null,null,null,0,0,0,0,0,0,0,0,0,0,0,0,0,0,0,0,0,0,0,0,0,0,0,0,0,0,0,null,null,null,null,null,null,null,null,null,null,null,null,null,null,null,null,"",null,"",null,null,null,{"$f":"IF(BF84=\"\",\"\",(IF(BF84=\"N\",\"\",(IF(BF84=\"Y\",(IF(BN84=\"\",\"\",(IF($BN84<1,1,(IF($BN84<3,2,3))))*1.05)))))))","v":""},"",null,"",null,"",null,"",null,"","","","","","","","","","","","","","","","",""]
[null,null,null,"South East as scattered tree","Eucalyptus arenacea - Eucalyptus baxteri (intergrade)",null,null,null,null,null,null,null,null,null,null,null,null,null,null,null,null,"",null,"",null,null,null,0,0,0,0,0,0,0,0,0,0,0,0,0,0,0,0,0,0,0,0,0,0,0,0,0,0,0,null,null,null,null,null,null,null,null,null,null,null,null,null,null,null,null,"",null,"",null,null,null,{"$f":"IF(BF85=\"\",\"\",(IF(BF85=\"N\",\"\",(IF(BF85=\"Y\",(IF(BN85=\"\",\"\",(IF($BN85<4.5,1,(IF($BN85<9,2,3))))*1.05)))))))","v":""},"",null,"",null,"",null,"",null,"","","","","","","","","","","","","","","","",""]
[null,null,null,"South East in bush block","Eucalyptus arenacea - Eucalyptus baxteri (intergrade)",null,null,null,null,null,null,null,null,null,null,null,null,null,null,null,null,"",null,"",null,null,null,0,0,0,0,0,0,0,0,0,0,0,0,0,0,0,0,0,0,0,0,0,0,0,0,0,0,0,null,null,null,null,null,null,null,null,null,null,null,null,null,null,null,null,"",null,"",null,null,null,{"$f":"IF(BF86=\"\",\"\",(IF(BF86=\"N\",\"\",(IF(BF86=\"Y\",(IF(BN86=\"\",\"\",(IF($BN86<6,1,(IF($BN86<12,2,3))))*1.05)))))))","v":""},"",null,"",null,"",null,"",null,"","","","","","","","","","","","","","","","",""]
[null,null,null,"Mt Lofty Block as scattered tree","Eucalyptus baxteri",null,null,null,null,null,null,null,null,null,null,null,null,null,null,null,null,"",null,"",null,null,null,0,0,0,0,0,0,0,0,0,0,0,0,0,0,0,0,0,0,0,0,0,0,0,0,0,0,0,null,null,null,null,null,null,null,null,null,null,null,null,null,null,null,null,"",null,"",null,null,null,{"$f":"IF(BF87=\"\",\"\",(IF(BF87=\"N\",\"\",(IF(BF87=\"Y\",(IF(BN87=\"\",\"\",(IF($BN87<7.5,1,(IF($BN87<15,2,3))))*1.05)))))))","v":""},"",null,"",null,"",null,"",null,"","","","","","","","","","","","","","","","",""]
[null,null,null,"Mt Lofty Block in bush block","Eucalyptus baxteri",null,null,null,null,null,null,null,null,null,null,null,null,null,null,null,null,"",null,"",null,null,null,0,0,0,0,0,0,0,0,0,0,0,0,0,0,0,0,0,0,0,0,0,0,0,0,0,0,0,null,null,null,null,null,null,null,null,null,null,null,null,null,null,null,null,"",null,"",null,null,null,{"$f":"IF(BF88=\"\",\"\",(IF(BF88=\"N\",\"\",(IF(BF88=\"Y\",(IF(BN88=\"\",\"\",(IF($BN88<9,1,(IF($BN88<18,2,3))))*1.05)))))))","v":""},"",null,"",null,"",null,"",null,"","","","","","","","","","","","","","","","",""]
[null,null,null,"Taller woodland trees-'Border farmland' area. Fig 4\nRated Rare - June 2014 - 20% loading added to SEB","Eucalyptus behriana",null,null,null,null,null,null,null,null,null,null,null,null,null,null,null,null,"",null,"",null,null,null,0,0,0,0,0,0,0,0,0,0,0,0,0,0,0,0,0,0,0,0,0,0,0,0,0,0,0,null,null,null,null,null,null,null,null,null,null,null,null,null,null,null,null,"",null,"",null,null,null,{"$f":"IF(BF89=\"\",\"\",(IF(BF89=\"N\",\"\",(IF(BF89=\"Y\",(IF(BN89=\"\",\"\",(IF($BN89<7.4,1,(IF($BN89<14.7,2,3))))*1.05)))))))","v":""},"",null,"",null,"",null,"",null,"","","","",{"$f":"IF(CI89=\"\",\"\",(((IF($CI89<20,4*$CI89/550,(IF($CI89<29.1,6*$CI89/550,(IF($CI89<40.1,8*$CI89/550,(IF($CI89<60.1,10*$CI89/550,12*$CI89/550))))))))*AA89))*120/100)","v":""},"","","","","","","","","","","",""]
[null,null,null,"Mallee Form-outside 'Border farmland' area. Fig 4\nRated Rare - June 2014 - 20% loading added to SEB","Eucalyptus behriana",null,null,null,null,null,null,null,null,null,null,null,null,null,null,null,null,"",null,"",null,null,null,0,0,0,0,0,0,0,0,0,0,0,0,0,0,0,0,0,0,0,0,0,0,0,0,0,0,0,null,null,null,null,null,null,null,null,null,null,null,null,null,null,null,null,"",null,"",null,null,null,{"$f":"IF(BF90=\"\",\"\",(IF(BF90=\"N\",\"\",(IF(BF90=\"Y\",(IF(BN90=\"\",\"\",(IF($BN90<4.8,1,(IF($BN90<9.5,2,3))))*1.05)))))))","v":""},"",null,"",null,"",null,"",null,"","","","",{"$f":"IF(CI90=\"\",\"\",(((IF($CI90<20,4*$CI90/550,(IF($CI90<29.1,6*$CI90/550,(IF($CI90<40.1,8*$CI90/550,(IF($CI90<60.1,10*$CI90/550,12*$CI90/550))))))))*AA90))*120/100)","v":""},"","","","","","","","","","","",""]
[null,null,null,null,"Eucalyptus brachycalyx",null,null,null,null,null,null,null,null,null,null,null,null,null,null,null,null,"",null,"",null,null,null,0,0,0,0,0,0,0,0,0,0,0,0,0,0,0,0,0,0,0,0,0,0,0,0,0,0,0,null,null,null,null,null,null,null,null,null,null,null,null,null,null,null,null,"",null,"",null,null,null,{"$f":"IF(BF91=\"\",\"\",(IF(BF91=\"N\",\"\",(IF(BF91=\"Y\",(IF(BN91=\"\",\"\",(IF($BN91<4,1,(IF($BN91<6,2,3))))*1.05)))))))","v":""},"",null,"",null,"",null,"",null,"","","","",{"$f":"IF(CI91=\"\",\"\",((IF($CI91<20,4*$CI91/550,(IF($CI91<29.1,6*$CI91/550,(IF($CI91<40.1,8*$CI91/550,(IF($CI91<60.1,10*$CI91/550,12*$CI91/550))))))))*AA91))","v":""},"","","","","","","","","","","",""]
[null,null,null,null,"Eucalyptus camaldulensis var camaldulensis",null,null,null,null,null,null,null,null,null,null,null,null,null,null,null,null,"",null,"",null,null,null,0,0,0,0,0,0,0,0,0,0,0,0,0,0,0,0,0,0,0,0,0,0,0,0,0,0,0,null,null,null,null,null,null,null,null,null,null,null,null,null,null,null,null,"",null,"",null,null,null,{"$f":"IF(BF92=\"\",\"\",(IF(BF92=\"N\",\"\",(IF(BF92=\"Y\",(IF(BN92=\"\",\"\",(IF($BN92<10,1,(IF($BN92<20,2,3))))*1.05)))))))","v":""},"",null,"",null,"",null,"",null,"","","","",{"$f":"IF(CI92=\"\",\"\",((IF($CI92<20,4*$CI92/550,(IF($CI92<29.1,6*$CI92/550,(IF($CI92<40.1,8*$CI92/550,(IF($CI92<60.1,10*$CI92/550,12*$CI92/550))))))))*AA92))","v":""},"","","","","","","","","","","",""]
[null,null,null,"Arid Areas (Badman 21/11/03)","Eucalyptus coolabah ssp. arida",null,null,null,null,null,null,null,null,null,null,null,null,null,null,null,null,"",null,"",null,null,null,0,0,0,0,0,0,0,0,0,0,0,0,0,0,0,0,0,0,0,0,0,0,0,0,0,0,0,null,null,null,null,null,null,null,null,null,null,null,null,null,null,null,null,"",null,"",null,null,null,{"$f":"IF(BF93=\"\",\"\",(IF(BF93=\"N\",\"\",(IF(BF93=\"Y\",(IF(BN93=\"\",\"\",(IF($BN93<4,1,(IF($BN93<6,2,3))))*1.05)))))))","v":""},"",null,"",null,"",null,"",null,"","","","",{"$f":"IF(CI93=\"\",\"\",((IF($CI93<20,4*$CI93/550,(IF($CI93<29.1,6*$CI93/550,(IF($CI93<40.1,8*$CI93/550,(IF($CI93<60.1,10*$CI93/550,12*$CI93/550))))))))*AA93))","v":""},"","","","","","","","","","","",""]
[null,null,null,null,"Eucalyptus cosmophylla",null,null,null,null,null,null,null,null,null,null,null,null,null,null,null,null,"",null,"",null,null,null,0,0,0,0,0,0,0,0,0,0,0,0,0,0,0,0,0,0,0,0,0,0,0,0,0,0,0,null,null,null,null,null,null,null,null,null,null,null,null,null,null,null,null,"",null,"",null,null,null,{"$f":"IF(BF94=\"\",\"\",(IF(BF94=\"N\",\"\",(IF(BF94=\"Y\",(IF(BN94=\"\",\"\",(IF($BN94<3.4,1,(IF($BN94<6.7,2,3))))*1.05)))))))","v":""},"",null,"",null,"",null,"",null,"","","","",{"$f":"IF(CI94=\"\",\"\",((IF($CI94<20,4*$CI94/550,(IF($CI94<29.1,6*$CI94/550,(IF($CI94<40.1,8*$CI94/550,(IF($CI94<60.1,10*$CI94/550,12*$CI94/550))))))))*AA94))","v":""},"","","","","","","","","","","",""]
[null,null,null,null,"Eucalyptus cyanophylla",null,null,null,null,null,null,null,null,null,null,null,null,null,null,null,null,"",null,"",null,null,null,0,0,0,0,0,0,0,0,0,0,0,0,0,0,0,0,0,0,0,0,0,0,0,0,0,0,0,null,null,null,null,null,null,null,null,null,null,null,null,null,null,null,null,"",null,"",null,null,null,{"$f":"IF(BF95=\"\",\"\",(IF(BF95=\"N\",\"\",(IF(BF95=\"Y\",(IF(BN95=\"\",\"\",(IF($BN95<2,1,(IF($BN95<4,2,3))))*1.05)))))))","v":""},"",null,"",null,"",null,"",null,"","","","",{"$f":"IF(CI95=\"\",\"\",((IF($CI95<20,4*$CI95/550,(IF($CI95<29.1,6*$CI95/550,(IF($CI95<40.1,8*$CI95/550,(IF($CI95<60.1,10*$CI95/550,12*$CI95/550))))))))*AA95))","v":""},"","","","","","","","","","","",""]
[null,null,null,"Rated Rare - June 2014 - 20% loading added to SEB","Eucalyptus dalrympleana ssp. dalrympleana",null,null,null,null,null,null,null,null,null,null,null,null,null,null,null,null,"",null,"",null,null,null,0,0,0,0,0,0,0,0,0,0,0,0,0,0,0,0,0,0,0,0,0,0,0,0,0,0,0,null,null,null,null,null,null,null,null,null,null,null,null,null,null,null,null,"",null,"",null,null,null,{"$f":"IF(BF96=\"\",\"\",(IF(BF96=\"N\",\"\",(IF(BF96=\"Y\",(IF(BN96=\"\",\"\",(IF($BN96<10,1,(IF($BN96<20,2,3))))*1.05)))))))","v":""},"",null,"",null,"",null,"",null,"","","","",{"$f":"IF(CI96=\"\",\"\",(((IF($CI96<20,4*$CI96/550,(IF($CI96<29.1,6*$CI96/550,(IF($CI96<40.1,8*$CI96/550,(IF($CI96<60.1,10*$CI96/550,12*$CI96/550))))))))*AA96))*120/100)","v":""},"","","","","","","","","","","",""]
[null,null,null,null,"Eucalyptus diversifolia",null,null,null,null,null,null,null,null,null,null,null,null,null,null,null,null,"",null,"",null,null,null,0,0,0,0,0,0,0,0,0,0,0,0,0,0,0,0,0,0,0,0,0,0,0,0,0,0,0,null,null,null,null,null,null,null,null,null,null,null,null,null,null,null,null,"",null,"",null,null,null,{"$f":"IF(BF97=\"\",\"\",(IF(BF97=\"N\",\"\",(IF(BF97=\"Y\",(IF(BN97=\"\",\"\",(IF($BN97<3.4,1,(IF($BN97<6.8,2,3))))*1.05)))))))","v":""},"",null,"",null,"",null,"",null,"","","","",{"$f":"IF(CI97=\"\",\"\",((IF($CI97<20,4*$CI97/550,(IF($CI97<29.1,6*$CI97/550,(IF($CI97<40.1,8*$CI97/550,(IF($CI97<60.1,10*$CI97/550,12*$CI97/550))))))))*AA97))","v":""},"","","","","","","","","","","",""]
[null,null,null,null,"Eucalyptus dumosa",null,null,null,null,null,null,null,null,null,null,null,null,null,null,null,null,"",null,"",null,null,null,0,0,0,0,0,0,0,0,0,0,0,0,0,0,0,0,0,0,0,0,0,0,0,0,0,0,0,null,null,null,null,null,null,null,null,null,null,null,null,null,null,null,null,"",null,"",null,null,null,{"$f":"IF(BF98=\"\",\"\",(IF(BF98=\"N\",\"\",(IF(BF98=\"Y\",(IF(BN98=\"\",\"\",(IF($BN98<3,1,(IF($BN98<5,2,3))))*1.05)))))))","v":""},"",null,"",null,"",null,"",null,"","","","",{"$f":"IF(CI98=\"\",\"\",((IF($CI98<20,4*$CI98/550,(IF($CI98<29.1,6*$CI98/550,(IF($CI98<40.1,8*$CI98/550,(IF($CI98<60.1,10*$CI98/550,12*$CI98/550))))))))*AA98))","v":""},"","","","","","","","","","","",""]
[null,null,null,"smaller bushy trees in northern areas of SE. Rated Rare - June 2014 - 20% loading added to SEB","Eucalyptus fasciculosa",null,null,null,null,null,null,null,null,null,null,null,null,null,null,null,null,"",null,"",null,null,null,0,0,0,0,0,0,0,0,0,0,0,0,0,0,0,0,0,0,0,0,0,0,0,0,0,0,0,null,null,null,null,null,null,null,null,null,null,null,null,null,null,null,null,"",null,"",null,null,null,{"$f":"IF(BF99=\"\",\"\",(IF(BF99=\"N\",\"\",(IF(BF99=\"Y\",(IF(BN99=\"\",\"\",(IF($BN99<4,1,(IF($BN99<8,2,3))))*1.05)))))))","v":""},"",null,"",null,"",null,"",null,"","","","",{"$f":"IF(CI99=\"\",\"\",(((IF($CI99<20,4*$CI99/550,(IF($CI99<29.1,6*$CI99/550,(IF($CI99<40.1,8*$CI99/550,(IF($CI99<60.1,10*$CI99/550,12*$CI99/550))))))))*AA99))*120/100)","v":""},"","","","","","","","","","","",""]
[null,null,null,"taller tree in SE higher rainfall areas and Mt Lofty Ranges Rated Rare - June 2014 - 20% loading added to SEB","Eucalyptus fasciculosa",null,null,null,null,null,null,null,null,null,null,null,null,null,null,null,null,"",null,"",null,null,null,0,0,0,0,0,0,0,0,0,0,0,0,0,0,0,0,0,0,0,0,0,0,0,0,0,0,0,null,null,null,null,null,null,null,null,null,null,null,null,null,null,null,null,"",null,"",null,null,null,{"$f":"IF(BF100=\"\",\"\",(IF(BF100=\"N\",\"\",(IF(BF100=\"Y\",(IF(BN100=\"\",\"\",(IF($BN100<8.5,1,(IF($BN100<17,2,3))))*1.05)))))))","v":""},"",null,"",null,"",null,"",null,"","","","",{"$f":"IF(CI100=\"\",\"\",(((IF($CI100<20,4*$CI100/550,(IF($CI100<29.1,6*$CI100/550,(IF($CI100<40.1,8*$CI100/550,(IF($CI100<60.1,10*$CI100/550,12*$CI100/550))))))))*AA100))*120/100)","v":""},"","","","","","","","","","","",""]
[null,null,null,null,"Eucalyptus goniocalyx ssp goniocalyx",null,null,null,null,null,null,null,null,null,null,null,null,null,null,null,null,"",null,"",null,null,null,0,0,0,0,0,0,0,0,0,0,0,0,0,0,0,0,0,0,0,0,0,0,0,0,0,0,0,null,null,null,null,null,null,null,null,null,null,null,null,null,null,null,null,"",null,"",null,null,null,{"$f":"IF(BF101=\"\",\"\",(IF(BF101=\"N\",\"\",(IF(BF101=\"Y\",(IF(BN101=\"\",\"\",(IF($BN101<6.8,1,(IF($BN101<13.5,2,3))))*1.05)))))))","v":""},"",null,"",null,"",null,"",null,"","","","",{"$f":"IF(CI101=\"\",\"\",((IF($CI101<20,4*$CI101/550,(IF($CI101<29.1,6*$CI101/550,(IF($CI101<40.1,8*$CI101/550,(IF($CI101<60.1,10*$CI101/550,12*$CI101/550))))))))*AA101))","v":""},"","","","","","","","","","","",""]
[null,null,null,"Mallee form","Eucalyptus gracilis",null,null,null,null,null,null,null,null,null,null,null,null,null,null,null,null,"",null,"",null,null,null,0,0,0,0,0,0,0,0,0,0,0,0,0,0,0,0,0,0,0,0,0,0,0,0,0,0,0,null,null,null,null,null,null,null,null,null,null,null,null,null,null,null,null,"",null,"",null,null,null,{"$f":"IF(BF102=\"\",\"\",(IF(BF102=\"N\",\"\",(IF(BF102=\"Y\",(IF(BN102=\"\",\"\",(IF($BN102<3,1,(IF($BN102<6,2,3))))*1.05)))))))","v":""},"",null,"",null,"",null,"",null,"","","","","","","","","","","","","","","","",""]
[null,null,null,"Tree form","Eucalyptus gracilis",null,null,null,null,null,null,null,null,null,null,null,null,null,null,null,null,"",null,"",null,null,null,0,0,0,0,0,0,0,0,0,0,0,0,0,0,0,0,0,0,0,0,0,0,0,0,0,0,0,null,null,null,null,null,null,null,null,null,null,null,null,null,null,null,null,"",null,"",null,null,null,{"$f":"IF(BF103=\"\",\"\",(IF(BF103=\"N\",\"\",(IF(BF103=\"Y\",(IF(BN103=\"\",\"\",(IF($BN103<4,1,(IF($BN103<6,2,3))))*1.05)))))))","v":""},"",null,"",null,"",null,"",null,"","","","","","","","","","","","","","","","",""]
[null,null,null,null,"Eucalyptus incrassata",null,null,null,null,null,null,null,null,null,null,null,null,null,null,null,null,"",null,"",null,null,null,0,0,0,0,0,0,0,0,0,0,0,0,0,0,0,0,0,0,0,0,0,0,0,0,0,0,0,null,null,null,null,null,null,null,null,null,null,null,null,null,null,null,null,"",null,"",null,null,null,{"$f":"IF(BF104=\"\",\"\",(IF(BF104=\"N\",\"\",(IF(BF104=\"Y\",(IF(BN104=\"\",\"\",(IF($BN104<2,1,(IF($BN104<4,2,3))))*1.05)))))))","v":""},"",null,"",null,"",null,"",null,"","","","","","","","","","","","","","","","",""]
[null,null,null,null,"Eucalyptus largiflorens",null,null,null,null,null,null,null,null,null,null,null,null,null,null,null,null,"",null,"",null,null,null,0,0,0,0,0,0,0,0,0,0,0,0,0,0,0,0,0,0,0,0,0,0,0,0,0,0,0,null,null,null,null,null,null,null,null,null,null,null,null,null,null,null,null,"",null,"",null,null,null,{"$f":"IF(BF105=\"\",\"\",(IF(BF105=\"N\",\"\",(IF(BF105=\"Y\",(IF(BN105=\"\",\"\",(IF($BN105<7.4,1,(IF($BN105<14.7,2,3))))*1.05)))))))","v":""},"",null,"",null,"",null,"",null,"","","","","","","","","","","","","","","","",""]
[null,null,null,null,"Eucalyptus leptophylla",null,null,null,null,null,null,null,null,null,null,null,null,null,null,null,null,"",null,"",null,null,null,0,0,0,0,0,0,0,0,0,0,0,0,0,0,0,0,0,0,0,0,0,0,0,0,0,0,0,null,null,null,null,null,null,null,null,null,null,null,null,null,null,null,null,"",null,"",null,null,null,{"$f":"IF(BF106=\"\",\"\",(IF(BF106=\"N\",\"\",(IF(BF106=\"Y\",(IF(BN106=\"\",\"\",(IF($BN106<2,1,(IF($BN106<4,2,3))))*1.05)))))))","v":""},"",null,"",null,"",null,"",null,"","","","","","","","","","","","","","","","",""]
[null,null,null,null,"Eucalyptus leucoxylon ssp leucoxylon",null,null,null,null,null,null,null,null,null,null,null,null,null,null,null,null,"",null,"",null,null,null,0,0,0,0,0,0,0,0,0,0,0,0,0,0,0,0,0,0,0,0,0,0,0,0,0,0,0,null,null,null,null,null,null,null,null,null,null,null,null,null,null,null,null,"",null,"",null,null,null,{"$f":"IF(BF107=\"\",\"\",(IF(BF107=\"N\",\"\",(IF(BF107=\"Y\",(IF(BN107=\"\",\"\",(IF($BN107<9,1,(IF($BN107<18,2,3))))*1.05)))))))","v":""},"",null,"",null,"",null,"",null,"","","","","","","","","","","","","","","","",""]
[null,null,null,"Rated Rare - June 2014 - 20% loading added to SEB","Eucalyptus leucoxylon ssp megalocarpa",null,null,null,null,null,null,null,null,null,null,null,null,null,null,null,null,"",null,"",null,null,null,0,0,0,0,0,0,0,0,0,0,0,0,0,0,0,0,0,0,0,0,0,0,0,0,0,0,0,null,null,null,null,null,null,null,null,null,null,null,null,null,null,null,null,"",null,"",null,null,null,{"$f":"IF(BF108=\"\",\"\",(IF(BF108=\"N\",\"\",(IF(BF108=\"Y\",(IF(BN108=\"\",\"\",(IF($BN108<3.4,1,(IF($BN108<6.8,2,3))))*1.05)))))))","v":""},"",null,"",null,"",null,"",null,"","","","",{"$f":"IF(CI108=\"\",\"\",(((IF($CI108<20,4*$CI108/550,(IF($CI108<29.1,6*$CI108/550,(IF($CI108<40.1,8*$CI108/550,(IF($CI108<60.1,10*$CI108/550,12*$CI108/550))))))))*AA108))*120/100)","v":""},"","","","","","","","","","","",""]
[null,null,null,null,"Eucalyptus leucoxylon ssp pruinosa",null,null,null,null,null,null,null,null,null,null,null,null,null,null,null,null,"",null,"",null,null,null,0,0,0,0,0,0,0,0,0,0,0,0,0,0,0,0,0,0,0,0,0,0,0,0,0,0,0,null,null,null,null,null,null,null,null,null,null,null,null,null,null,null,null,"",null,"",null,null,null,{"$f":"IF(BF109=\"\",\"\",(IF(BF109=\"N\",\"\",(IF(BF109=\"Y\",(IF(BN109=\"\",\"\",(IF($BN109<6.8,1,(IF($BN109<13.5,2,3))))*1.05)))))))","v":""},"",null,"",null,"",null,"",null,"","","","",{"$f":"IF(CI109=\"\",\"\",((IF($CI109<20,4*$CI109/550,(IF($CI109<29.1,6*$CI109/550,(IF($CI109<40.1,8*$CI109/550,(IF($CI109<60.1,10*$CI109/550,12*$CI109/550))))))))*AA109))","v":""},"","","","","","","","","","","",""]
[null,null,null,null,"Eucalyptus leucoxylon ssp stephaniae",null,null,null,null,null,null,null,null,null,null,null,null,null,null,null,null,"",null,"",null,null,null,0,0,0,0,0,0,0,0,0,0,0,0,0,0,0,0,0,0,0,0,0,0,0,0,0,0,0,null,null,null,null,null,null,null,null,null,null,null,null,null,null,null,null,"",null,"",null,null,null,{"$f":"IF(BF110=\"\",\"\",(IF(BF110=\"N\",\"\",(IF(BF110=\"Y\",(IF(BN110=\"\",\"\",(IF($BN110<5,1,(IF($BN110<10,2,3))))*1.05)))))))","v":""},"",null,"",null,"",null,"",null,"","","","","","","","","","","","","","","","",""]
[null,null,null,null,"Eucalyptus microcarpa",null,null,null,null,null,null,null,null,null,null,null,null,null,null,null,null,"",null,"",null,null,null,0,0,0,0,0,0,0,0,0,0,0,0,0,0,0,0,0,0,0,0,0,0,0,0,0,0,0,null,null,null,null,null,null,null,null,null,null,null,null,null,null,null,null,"",null,"",null,null,null,{"$f":"IF(BF111=\"\",\"\",(IF(BF111=\"N\",\"\",(IF(BF111=\"Y\",(IF(BN111=\"\",\"\",(IF($BN111<7.4,1,(IF($BN111<14.7,2,3))))*1.05)))))))","v":""},"",null,"",null,"",null,"",null,"","","","","","","","","","","","","","","","",""]
[null,null,null,"larger, scattered trees -Adelaide hills & lower SE","Eucalyptus obliqua",null,null,null,null,null,null,null,null,null,null,null,null,null,null,null,null,"",null,"",null,null,null,0,0,0,0,0,0,0,0,0,0,0,0,0,0,0,0,0,0,0,0,0,0,0,0,0,0,0,null,null,null,null,null,null,null,null,null,null,null,null,null,null,null,null,"",null,"",null,null,null,{"$f":"IF(BF112=\"\",\"\",(IF(BF112=\"N\",\"\",(IF(BF112=\"Y\",(IF(BN112=\"\",\"\",(IF($BN112<9,1,(IF($BN112<18,2,3))))*1.05)))))))","v":""},"",null,"",null,"",null,"",null,"","","","","","","","","","","","","","","","",""]
[null,null,null,"larger trees in bush block-Adelaide hills & lower SE","Eucalyptus obliqua",null,null,null,null,null,null,null,null,null,null,null,null,null,null,null,null,{"$f":"IF(BF113=\"\",\"\",(IF(U113=\"\",\"\",(IF(BF113=\"N\",\"\",(IF(BF113=\"Y\",U113)))))))","v":""},null,{"$f":"IF(V113=\"\",\"\",(IF(BF113=\"N\",\"\",((V113*W113)/10000))))","v":""},null,null,null,0,0,0,0,0,0,0,0,0,0,0,0,0,0,0,0,0,0,0,0,0,0,0,0,0,0,0,null,null,null,null,null,null,null,null,null,null,null,null,null,null,null,null,{"$f":"IF(BK113=\"\",\"\",(BK113*12))","v":""},null,"",null,null,null,{"$f":"IF(BF113=\"\",\"\",(IF(BF113=\"N\",\"\",(IF(BF113=\"Y\",(IF(BN113=\"\",\"\",(IF($BN113<10,1,(IF($BN113<20,2,3))))*1.05)))))))","v":""},"",null,"",null,"",null,"",null,"","","","","",{"$f":"IF(BF113=\"\",\"\",(IF(BF113=\"N\",\"\",(IF(T113=\"Y\",\"Y\",(IF(AA113=\"\",\"Y\",(IF(AA113=0,\"\",(IF(BF113=\"Y\",(AB113+AC113+AE113+AF113+AH113+AI113))))))))))))","v":""},{"$f":"IF(BG113=\"\",\"\",(IF(BG113=\"N\",\"\",(IF(BF113=\"Y\",\"\",(IF(Q113=\"Y\",\"\",(IF(BG113=\"Y\",(AW113+AY113+AZ113+BB113))))))))))","v":""},{"$f":"(IF(BF113=\"Y\",\"\",(IF(BG113=\"Y\",\"\",(IF(AL113>0,\"\",(IF(T113=\"Y\",\"Y\",(IF(AA113=\"\",\"\",(IF(AJ113>0,BI113,(IF(AK113>0,BI113,(AM113+AN113+AR113+AS113+AU113+AV113+AP113+AQ113)))))))))))))))","v":""},{"$f":"(IF(AA113=\"\",\"\",(IF(M113=\"\",\"\",(IF(Q113=\"Y\",\"\",(IF(BG113=\"N\",\"\",(IF(BF113=\"Y\",\"\",(IF(BG113=\"Y\",(AX113+BA113)))))))))))))","v":""},"",{"$f":"IF(AA113=\"\",\"\",(IF(Q113=\"Y\",\"\",(IF(AR113=0,\"\",(AR113))))))","v":""},{"$f":"IF(AO113=0,\"\",(IF(Q113=\"Y\",\"\",(AO113*2))))","v":""},{"$f":"IF(AM113=0,\"\",(IF(Q113=\"Y\",\"\",(AM113*2))))","v":""},"","",{"$f":"IF(BN113=\"\",\"\",(IF(S113=\"Y\",\"\",(IF(R113=\"Y\",\"\",(IF(Q113=\"Y\",\"\",(IF(T113=\"Y\",\"\",(IF(BF113=\"\",\"\",(IF(BF113=\"N\",\"\",(CL113))))))))))))))","v":""},""]
[null,null,null,"smaller, scattered trees in Furner/Callendale & Cape Banks districts","Eucalyptus obliqua",null,null,null,null,null,null,null,null,null,null,null,null,null,null,null,null,"",null,"",null,null,null,0,0,0,0,0,0,0,0,0,0,0,0,0,0,0,0,0,0,0,0,0,0,0,0,0,0,0,null,null,null,null,null,null,null,null,null,null,null,null,null,null,null,null,"",null,{"$f":"(IF(BT114=\"\",\"\",((BT114*50)^0.42)*0.64))","v":""},null,null,null,{"$f":"IF(BF114=\"\",\"\",(IF(BF114=\"N\",\"\",(IF(BF114=\"Y\",(IF(BN114=\"\",\"\",(IF($BN114<5.75,1,(IF($BN114<11.5,2,3))))*1.05)))))))","v":""},"",null,{"$f":"IF(CA114=\"\",\"\",(IF(BF114=\"N\",\"\",(IF(BF114=\"Y\",(CA114*1.45))))))","v":""},null,{"$f":"IF(CC114=\"\",\"\",(IF(BF114=\"N\",\"\",(IF(BF114=\"Y\",(CC114*0.65))))))","v":""},null,{"$f":"IF(CE114=\"\",\"\",(IF(BF114=\"N\",\"\",(IF(BF114=\"Y\",(CE114*0.4))))))","v":""},null,{"$f":"IF(CG114=\"\",\"\",(IF(BF114=\"N\",\"\",(IF(BF114=\"Y\",(CG114*0.35))))))","v":""},{"$f":"IF(BY114=\"\",\"\",(SUM(BY114,BZ114,CB114,CD114,CF114,CH114)*SUM(BY114,BZ114,CB114,CD114,CF114,CH114)*SUM(BY114,BZ114,CB114,CD114,CF114,CH114)/55.5))","v":""},{"$f":"IF(CI114=\"\",\"\",IF(CI114<30,0,(IF(CI114>=30,1))))","v":""},{"$f":"IF(CI114=\"\",\"\",(IF(CJ114=1,CJ114=\"@\",(IF(CJ114=0,(IF($CI114<20,4*$CI114/550,(IF($CI114<30,6*$CI114/550,(IF($CI114<41,8*$CI114/550,(IF($CI114<61,10*$CI114/550,12*$CI114/550)))))))))))))","v":""},"","","","","","","","","","","","",""]
[null,null,null,"smaller trees in bush block in Furner/Callendale & Cape Banks districts","Eucalyptus obliqua",null,null,null,null,null,null,null,null,null,null,null,null,null,null,null,null,"",null,"",null,null,null,0,0,0,0,0,0,0,0,0,0,0,0,0,0,0,0,0,0,0,0,0,0,0,0,0,0,0,null,null,null,null,null,null,null,null,null,null,null,null,null,null,null,null,"",null,"",null,null,null,{"$f":"IF(BF115=\"\",\"\",(IF(BF115=\"N\",\"\",(IF(BF115=\"Y\",(IF(BN115=\"\",\"\",(IF($BN115<6.8,1,(IF($BN115<13.5,2,3))))*1.05)))))))","v":""},{"$f":"IF(BV115=\"\",\"\",(IF(BF115=\"N\",\"\",(IF(BF115=\"Y\",((100-$BV115)*0.04)+2)))))","v":""},null,"",null,"",null,"",null,"","","","","","","","","","","","","","","","",""]
[null,null,null,null,"Eucalyptus odorata",null,null,null,null,null,null,null,null,null,null,null,null,null,null,null,null,"",null,"",null,null,null,0,0,0,0,0,0,0,0,0,0,0,0,0,0,0,0,0,0,0,0,0,0,0,0,0,0,0,null,null,null,null,null,null,null,null,null,null,null,null,null,null,null,null,"",null,"",null,null,null,{"$f":"IF(BF116=\"\",\"\",(IF(BF116=\"N\",\"\",(IF(BF116=\"Y\",(IF(BN116=\"\",\"\",(IF($BN116<4.8,1,(IF($BN116<9.5,2,3))))*1.05)))))))","v":""},"",null,"",null,"",null,"",null,"","","","","","","","","","","","","","","","",""]
[null,null,null,null,"Eucalyptus oleosa",null,null,null,null,null,null,null,null,null,null,null,null,null,null,null,null,"",null,"",null,null,null,0,0,0,0,0,0,0,0,0,0,0,0,0,0,0,0,0,0,0,0,0,0,0,0,0,0,0,null,null,null,null,null,null,null,null,null,null,null,null,null,null,null,null,"",null,"",null,null,null,{"$f":"IF(BF117=\"\",\"\",(IF(BF117=\"N\",\"\",(IF(BF117=\"Y\",(IF(BN117=\"\",\"\",(IF($BN117<3,1,(IF($BN117<6,2,3))))*1.05)))))))","v":""},"",null,"",null,"",null,"",null,"","","","","","","","","","","","","","","","",""]
[null,null,null,"smaller trees on flats & water courses","Eucalyptus ovata",null,null,null,null,null,null,null,null,null,null,null,null,null,null,null,null,"",null,"",null,null,null,0,0,0,0,0,0,0,0,0,0,0,0,0,0,0,0,0,0,0,0,0,0,0,0,0,0,0,null,null,null,null,null,null,null,null,null,null,null,null,null,null,null,null,"",null,"",null,null,null,{"$f":"IF(BF118=\"\",\"\",(IF(BF118=\"N\",\"\",(IF(BF118=\"Y\",(IF(BN118=\"\",\"\",(IF($BN118<6.8,1,(IF($BN118<13.5,2,3))))*1.05)))))))","v":""},"",null,"",null,"",null,"",null,"","","","","","","","","","","","","","","","",""]
[null,null,null,"larger trees on swamps, usually elevated & closed-forestry reserves & area NE Mt Gambier","Eucalyptus ovata",null,null,null,null,null,null,null,null,null,null,null,null,null,null,null,null,"",null,"",null,null,null,0,0,0,0,0,0,0,0,0,0,0,0,0,0,0,0,0,0,0,0,0,0,0,0,0,0,0,null,null,null,null,null,null,null,null,null,null,null,null,null,null,null,null,"",null,"",null,null,null,{"$f":"IF(BF119=\"\",\"\",(IF(BF119=\"N\",\"\",(IF(BF119=\"Y\",(IF(BN119=\"\",\"\",(IF($BN119<9,1,(IF($BN119<18,2,3))))*1.05)))))))","v":""},"",null,"",null,"",null,"",null,"","","","","","","","","","","","","","","","",""]
[null,null,null,null,"Eucalyptus phenax",null,null,null,null,null,null,null,null,null,null,null,null,null,null,null,null,"",null,"",null,null,null,0,0,0,0,0,0,0,0,0,0,0,0,0,0,0,0,0,0,0,0,0,0,0,0,0,0,0,null,null,null,null,null,null,null,null,null,null,null,null,null,null,null,null,"",null,"",null,null,null,{"$f":"IF(BF120=\"\",\"\",(IF(BF120=\"N\",\"\",(IF(BF120=\"Y\",(IF(BN120=\"\",\"\",(IF($BN120<2,1,(IF($BN120<4,2,3))))*1.05)))))))","v":""},"",null,"",null,"",null,"",null,"","","","","","","","","","","","","","","","",""]
[null,null,null,null,"Eucalyptus porosa",null,null,null,null,null,null,null,null,null,null,null,null,null,null,null,null,"",null,"",null,null,null,0,0,0,0,0,0,0,0,0,0,0,0,0,0,0,0,0,0,0,0,0,0,0,0,0,0,0,null,null,null,null,null,null,null,null,null,null,null,null,null,null,null,null,"",null,"",null,null,null,{"$f":"IF(BF121=\"\",\"\",(IF(BF121=\"N\",\"\",(IF(BF121=\"Y\",(IF(BN121=\"\",\"\",(IF($BN121<3.4,1,(IF($BN121<6.8,2,3))))*1.05)))))))","v":""},"",null,"",null,"",null,"",null,"","","","","","","","","","","","","","","","",""]
[null,null,null,null,"Eucalyptus porosa x Eucalyptus microcarpa",null,null,null,null,null,null,null,null,null,null,null,null,null,null,null,null,"",null,"",null,null,null,0,0,0,0,0,0,0,0,0,0,0,0,0,0,0,0,0,0,0,0,0,0,0,0,0,0,0,null,null,null,null,null,null,null,null,null,null,null,null,null,null,null,null,"",null,"",null,null,null,{"$f":"IF(BF122=\"\",\"\",(IF(BF122=\"N\",\"\",(IF(BF122=\"Y\",(IF(BN122=\"\",\"\",(IF($BN122<5.9,1,(IF($BN122<11.8,2,3))))*1.05)))))))","v":""},"",null,"",null,"",null,"",null,"","","","","","","","","","","","","","","","",""]
[null,null,null,null,"Eucalyptus socialis",null,null,null,null,null,null,null,null,null,null,null,null,null,null,null,null,"",null,"",null,null,null,0,0,0,0,0,0,0,0,0,0,0,0,0,0,0,0,0,0,0,0,0,0,0,0,0,0,0,null,null,null,null,null,null,null,null,null,null,null,null,null,null,null,null,"",null,"",null,null,null,{"$f":"IF(BF123=\"\",\"\",(IF(BF123=\"N\",\"\",(IF(BF123=\"Y\",(IF(BN123=\"\",\"\",(IF($BN123<3,1,(IF($BN123<6,2,3))))*1.05)))))))","v":""},"",null,"",null,"",null,"",null,"","","","","","","","","","","","","","","","",""]
[null,null,null,null,"Eucalyptus viminalis ssp cygnetensis",null,null,null,null,null,null,null,null,null,null,null,null,null,null,null,null,"",null,"",null,null,null,0,0,0,0,0,0,0,0,0,0,0,0,0,0,0,0,0,0,0,0,0,0,0,0,0,0,0,null,null,null,null,null,null,null,null,null,null,null,null,null,null,null,null,"",null,"",null,null,null,{"$f":"IF(BF124=\"\",\"\",(IF(BF124=\"N\",\"\",(IF(BF124=\"Y\",(IF(BN124=\"\",\"\",(IF($BN124<7.4,1,(IF($BN124<14.7,2,3))))*1.05)))))))","v":""},"",null,"",null,"",null,"",null,"","","","","","","","","","","","","","","","",""]
[null,null,null,"Rated Rare - June 2014 - 20% loading added to SEB","Eucalyptus viminalis ssp viminalis",null,null,null,null,null,null,null,null,null,null,null,null,null,null,null,null,"",null,"",null,null,null,0,0,0,0,0,0,0,0,0,0,0,0,0,0,0,0,0,0,0,0,0,0,0,0,0,0,0,null,null,null,null,null,null,null,null,null,null,null,null,null,null,null,null,"",null,"",null,null,null,{"$f":"IF(BF125=\"\",\"\",(IF(BF125=\"N\",\"\",(IF(BF125=\"Y\",(IF(BN125=\"\",\"\",(IF($BN125<10,1,(IF($BN125<20,2,3))))*1.05)))))))","v":""},"",null,"",null,"",null,"",null,"","","","",{"$f":"IF(CI125=\"\",\"\",(((IF($CI125<20,4*$CI125/550,(IF($CI125<29.1,6*$CI125/550,(IF($CI125<40.1,8*$CI125/550,(IF($CI125<60.1,10*$CI125/550,12*$CI125/550))))))))*AA125))*120/100)","v":""},"","","","","","","","","","","",""]
[null,null,null,null,"Eucalyptus willisii ssp falciformis",null,null,null,null,null,null,null,null,null,null,null,null,null,null,null,null,"",null,"",null,null,null,0,0,0,0,0,0,0,0,0,0,0,0,0,0,0,0,0,0,0,0,0,0,0,0,0,0,0,null,null,null,null,null,null,null,null,null,null,null,null,null,null,null,null,"",null,"",null,null,null,{"$f":"IF(BF126=\"\",\"\",(IF(BF126=\"N\",\"\",(IF(BF126=\"Y\",(IF(BN126=\"\",\"\",(IF($BN126<4,1,(IF($BN126<8,2,3))))*1.05)))))))","v":""},"",null,"",null,"",null,"",null,"","","","",{"$f":"IF(CI126=\"\",\"\",((IF($CI126<20,4*$CI126/550,(IF($CI126<29.1,6*$CI126/550,(IF($CI126<40.1,8*$CI126/550,(IF($CI126<60.1,10*$CI126/550,12*$CI126/550))))))))*AA126))","v":""},"","","","","","","","","","","",""]
[null,null,null,null,"Exocarpus aphyllus",null,null,null,null,null,null,null,null,null,null,null,null,null,null,null,null,"",null,"",null,null,null,0,0,0,0,0,0,0,0,0,0,0,0,0,0,0,0,0,0,0,0,0,0,0,0,0,0,0,null,null,null,null,null,null,null,null,null,null,null,null,null,null,null,null,"",null,"",null,null,null,{"$f":"IF(BF127=\"\",\"\",(IF(BF127=\"N\",\"\",(IF(BF127=\"Y\",(IF(BN127=\"\",\"\",(IF($BN127<1.5,1,(IF($BN127<3,2,3))))*1.05)))))))","v":""},"",null,"",null,"",null,"",null,"","","","","","","","","","","","","","","","",""]
[null,null,null,"Arid Areas (Badman 21/11/03)","Exocarpus sparteus",null,null,null,null,null,null,null,null,null,null,null,null,null,null,null,null,"",null,"",null,null,null,0,0,0,0,0,0,0,0,0,0,0,0,0,0,0,0,0,0,0,0,0,0,0,0,0,0,0,null,null,null,null,null,null,null,null,null,null,null,null,null,null,null,null,"",null,"",null,null,null,{"$f":"IF(BF128=\"\",\"\",(IF(BF128=\"N\",\"\",(IF(BF128=\"Y\",(IF(BN128=\"\",\"\",(IF($BN128<3.5,1,(IF($BN128<4.5,2,3))))*1.05)))))))","v":""},"",null,"",null,"",null,"",null,"","","","","","","","","","","","","","","","",""]
[null,null,null,"Arid Areas (Badman 21/11/03)","Grevillea striata",null,null,null,null,null,null,null,null,null,null,null,null,null,null,null,null,"",null,"",null,null,null,0,0,0,0,0,0,0,0,0,0,0,0,0,0,0,0,0,0,0,0,0,0,0,0,0,0,0,null,null,null,null,null,null,null,null,null,null,null,null,null,null,null,null,"",null,"",null,null,null,{"$f":"IF(BF129=\"\",\"\",(IF(BF129=\"N\",\"\",(IF(BF129=\"Y\",(IF(BN129=\"\",\"\",(IF($BN129<4,1,(IF($BN129<6,2,3))))*1.05)))))))","v":""},"",null,"",null,"",null,"",null,"","","","","","","","","","","","","","","","",""]
[null,null,null,"Arid Areas (Badman 21/11/03)","Gyrostemon ramulosus",null,null,null,null,null,null,null,null,null,null,null,null,null,null,null,null,"",null,"",null,null,null,0,0,0,0,0,0,0,0,0,0,0,0,0,0,0,0,0,0,0,0,0,0,0,0,0,0,0,null,null,null,null,null,null,null,null,null,null,null,null,null,null,null,null,"",null,"",null,null,null,{"$f":"IF(BF130=\"\",\"\",(IF(BF130=\"N\",\"\",(IF(BF130=\"Y\",(IF(BN130=\"\",\"\",(IF($BN130<3,1,(IF($BN130<4,2,3))))*1.05)))))))","v":""},"",null,"",null,"",null,"",null,"","","","","","","","","","","","","","","","",""]
[null,null,null,"Arid Areas (Badman 21/11/03)","Hakea divaricata",null,null,null,null,null,null,null,null,null,null,null,null,null,null,null,null,"",null,"",null,null,null,0,0,0,0,0,0,0,0,0,0,0,0,0,0,0,0,0,0,0,0,0,0,0,0,0,0,0,null,null,null,null,null,null,null,null,null,null,null,null,null,null,null,null,"",null,"",null,null,null,{"$f":"IF(BF131=\"\",\"\",(IF(BF131=\"N\",\"\",(IF(BF131=\"Y\",(IF(BN131=\"\",\"\",(IF($BN131<3,1,(IF($BN131<4,2,3))))*1.05)))))))","v":""},"",null,"",null,"",null,"",null,"","","","","","","","","","","","","","","","",""]
[null,null,null,"Arid Areas (Badman 21/11/03)","Hakea ednieana",null,null,null,null,null,null,null,null,null,null,null,null,null,null,null,null,"",null,"",null,null,null,0,0,0,0,0,0,0,0,0,0,0,0,0,0,0,0,0,0,0,0,0,0,0,0,0,0,0,null,null,null,null,null,null,null,null,null,null,null,null,null,null,null,null,"",null,"",null,null,null,{"$f":"IF(BF132=\"\",\"\",(IF(BF132=\"N\",\"\",(IF(BF132=\"Y\",(IF(BN132=\"\",\"\",(IF($BN132<3,1,(IF($BN132<4,2,3))))*1.05)))))))","v":""},"",null,"",null,"",null,"",null,"","","","","","","","","","","","","","","","",""]
[null,null,null,"Arid Areas (Badman 21/11/03)","Hakea eyreana",null,null,null,null,null,null,null,null,null,null,null,null,null,null,null,null,"",null,"",null,null,null,0,0,0,0,0,0,0,0,0,0,0,0,0,0,0,0,0,0,0,0,0,0,0,0,0,0,0,null,null,null,null,null,null,null,null,null,null,null,null,null,null,null,null,"",null,"",null,null,null,{"$f":"IF(BF133=\"\",\"\",(IF(BF133=\"N\",\"\",(IF(BF133=\"Y\",(IF(BN133=\"\",\"\",(IF($BN133<2.5,1,(IF($BN133<3,2,3))))*1.05)))))))","v":""},"",null,"",null,"",null,"",null,"","","","","","","","","","","","","","","","",""]
[null,null,null,"Arid Areas (Badman 21/11/03)","Hakea francisiana",null,null,null,null,null,null,null,null,null,null,null,null,null,null,null,null,"",null,"",null,null,null,0,0,0,0,0,0,0,0,0,0,0,0,0,0,0,0,0,0,0,0,0,0,0,0,0,0,0,null,null,null,null,null,null,null,null,null,null,null,null,null,null,null,null,"",null,"",null,null,null,{"$f":"IF(BF134=\"\",\"\",(IF(BF134=\"N\",\"\",(IF(BF134=\"Y\",(IF(BN134=\"\",\"\",(IF($BN134<3,1,(IF($BN134<4,2,3))))*1.05)))))))","v":""},"",null,"",null,"",null,"",null,"","","","","","","","","","","","","","","","",""]
[null,null,null,null,"Hakea leucoptera",null,null,null,null,null,null,null,null,null,null,null,null,null,null,null,null,"",null,"",null,null,null,0,0,0,0,0,0,0,0,0,0,0,0,0,0,0,0,0,0,0,0,0,0,0,0,0,0,0,null,null,null,null,null,null,null,null,null,null,null,null,null,null,null,null,"",null,"",null,null,null,{"$f":"IF(BF135=\"\",\"\",(IF(BF135=\"N\",\"\",(IF(BF135=\"Y\",(IF(BN135=\"\",\"\",(IF($BN135<3,1,(IF($BN135<6,2,3))))*1.05)))))))","v":""},"",null,"",null,"",null,"",null,"","","","","","","","","","","","","","","","",""]
[null,null,null,"Arid Areas","Hakea leucoptera",null,null,null,null,null,null,null,null,null,null,null,null,null,null,null,null,"",null,"",null,null,null,0,0,0,0,0,0,0,0,0,0,0,0,0,0,0,0,0,0,0,0,0,0,0,0,0,0,0,null,null,null,null,null,null,null,null,null,null,null,null,null,null,null,null,"",null,"",null,null,null,{"$f":"IF(BF136=\"\",\"\",(IF(BF136=\"N\",\"\",(IF(BF136=\"Y\",(IF(BN136=\"\",\"\",(IF($BN136<1,1,(IF($BN136<8,2,3))))*1.05)))))))","v":""},"",null,"",null,"",null,"",null,"","","","","","","","","","","","","","","","",""]
[null,null,null,"Arid Areas (Badman 21/11/03)","Hakea suberea",null,null,null,null,null,null,null,null,null,null,null,null,null,null,null,null,"",null,"",null,null,null,0,0,0,0,0,0,0,0,0,0,0,0,0,0,0,0,0,0,0,0,0,0,0,0,0,0,0,null,null,null,null,null,null,null,null,null,null,null,null,null,null,null,null,"",null,"",null,null,null,{"$f":"IF(BF137=\"\",\"\",(IF(BF137=\"N\",\"\",(IF(BF137=\"Y\",(IF(BN137=\"\",\"\",(IF($BN137<4,1,(IF($BN137<5.5,2,3))))*1.05)))))))","v":""},"",null,"",null,"",null,"",null,"","","","","","","","","","","","","","","","",""]
[null,null,null,"Arid Areas (Badman 21/11/03)","Lysiphyllum gilvum",null,null,null,null,null,null,null,null,null,null,null,null,null,null,null,null,"",null,"",null,null,null,0,0,0,0,0,0,0,0,0,0,0,0,0,0,0,0,0,0,0,0,0,0,0,0,0,0,0,null,null,null,null,null,null,null,null,null,null,null,null,null,null,null,null,"",null,"",null,null,null,{"$f":"IF(BF138=\"\",\"\",(IF(BF138=\"N\",\"\",(IF(BF138=\"Y\",(IF(BN138=\"\",\"\",(IF($BN138<3,1,(IF($BN138<4,2,3))))*1.05)))))))","v":""},"",null,"",null,"",null,"",null,"","","","","","","","","","","","","","","","",""]
[null,null,null,null,"Melaleuca brevifolia",null,null,null,null,null,null,null,null,null,null,null,null,null,null,null,null,"",null,"",null,null,null,0,0,0,0,0,0,0,0,0,0,0,0,0,0,0,0,0,0,0,0,0,0,0,0,0,0,0,null,null,null,null,null,null,null,null,null,null,null,null,null,null,null,null,"",null,"",null,null,null,{"$f":"IF(BF139=\"\",\"\",(IF(BF139=\"N\",\"\",(IF(BF139=\"Y\",(IF(BN139=\"\",\"\",(IF($BN139<1,1,(IF($BN139<2,2,3))))*1.05)))))))","v":""},"",null,"",null,"",null,"",null,"","","","","","","","","","","","","","","","",""]
[null,null,null,"Arid Areas (Badman 21/11/03)","Melaleuca glomerata",null,null,null,null,null,null,null,null,null,null,null,null,null,null,null,null,"",null,"",null,null,null,0,0,0,0,0,0,0,0,0,0,0,0,0,0,0,0,0,0,0,0,0,0,0,0,0,0,0,null,null,null,null,null,null,null,null,null,null,null,null,null,null,null,null,"",null,"",null,null,null,{"$f":"IF(BF140=\"\",\"\",(IF(BF140=\"N\",\"\",(IF(BF140=\"Y\",(IF(BN140=\"\",\"\",(IF($BN140<3,1,(IF($BN140<4.5,2,3))))*1.05)))))))","v":""},"",null,"",null,"",null,"",null,"","","","","","","","","","","","","","","","",""]
[null,null,null,null,"Melaleuca halmaturorum",null,null,null,null,null,null,null,null,null,null,null,null,null,null,null,null,"",null,"",null,null,null,0,0,0,0,0,0,0,0,0,0,0,0,0,0,0,0,0,0,0,0,0,0,0,0,0,0,0,null,null,null,null,null,null,null,null,null,null,null,null,null,null,null,null,"",null,"",null,null,null,{"$f":"IF(BF141=\"\",\"\",(IF(BF141=\"N\",\"\",(IF(BF141=\"Y\",(IF(BN141=\"\",\"\",(IF($BN141<2.5,1,(IF($BN141<5,2,3))))*1.05)))))))","v":""},"",null,"",null,"",null,"",null,"","","","","","","","","","","","","","","","",""]
[null,null,null,"SE & southern Murray Mallee","Melaleuca lanceolata",null,null,null,null,null,null,null,null,null,null,null,null,null,null,null,null,"",null,"",null,null,null,0,0,0,0,0,0,0,0,0,0,0,0,0,0,0,0,0,0,0,0,0,0,0,0,0,0,0,null,null,null,null,null,null,null,null,null,null,null,null,null,null,null,null,"",null,"",null,null,null,{"$f":"IF(BF142=\"\",\"\",(IF(BF142=\"N\",\"\",(IF(BF142=\"Y\",(IF(BN142=\"\",\"\",(IF($BN142<3,1,(IF($BN142<6,2,3))))*1.05)))))))","v":""},"",null,"",null,"",null,"",null,"","","","","","","","","","","","","","","","",""]
[null,null,null,"Arid Areas (Badman 21/11/03)","Melaleuca linariifolia var. trichostachya",null,null,null,null,null,null,null,null,null,null,null,null,null,null,null,null,"",null,"",null,null,null,0,0,0,0,0,0,0,0,0,0,0,0,0,0,0,0,0,0,0,0,0,0,0,0,0,0,0,null,null,null,null,null,null,null,null,null,null,null,null,null,null,null,null,"",null,"",null,null,null,{"$f":"IF(BF143=\"\",\"\",(IF(BF143=\"N\",\"\",(IF(BF143=\"Y\",(IF(BN143=\"\",\"\",(IF($BN143<3,1,(IF($BN143<5,2,3))))*1.05)))))))","v":""},"",null,"",null,"",null,"",null,"","","","","","","","","","","","","","","","",""]
[null,null,null,"Arid Areas (Badman 21/11/03)","Melaleuca pauperiflora ssp. mutica",null,null,null,null,null,null,null,null,null,null,null,null,null,null,null,null,"",null,"",null,null,null,0,0,0,0,0,0,0,0,0,0,0,0,0,0,0,0,0,0,0,0,0,0,0,0,0,0,0,null,null,null,null,null,null,null,null,null,null,null,null,null,null,null,null,"",null,"",null,null,null,{"$f":"IF(BF144=\"\",\"\",(IF(BF144=\"N\",\"\",(IF(BF144=\"Y\",(IF(BN144=\"\",\"\",(IF($BN144<2.5,1,(IF($BN144<3,2,3))))*1.05)))))))","v":""},"",null,"",null,"",null,"",null,"","","","","","","","","","","","","","","","",""]
[null,null,null,"Arid Areas (Badman 21/11/03)","Melaleuca uncinata",null,null,null,null,null,null,null,null,null,null,null,null,null,null,null,null,{"$f":"IF(BF145=\"\",\"\",(IF(U145=\"\",\"\",(IF(BF145=\"N\",\"\",(IF(BF145=\"Y\",U145)))))))","v":""},null,{"$f":"IF(V145=\"\",\"\",(IF(BF145=\"N\",\"\",((V145*W145)/10000))))","v":""},null,null,null,{"$f":"IF(M145=\"\",0,(IF(T145=\"\",0,(IF(T145=\"Y\",0,(IF(S145=\"Y\",0, (IF(R145=\"Y\",0,(IF(BF145=\"N\",0,(IF(M145=\"P\",AA145)))))))))))))","v":0},{"$f":"IF(N145=\"\",0,(IF(T145=\"\",0,(IF(T145=\"Y\",0,(IF(S145=\"Y\",0, (IF(R145=\"Y\",0,(IF(BF145=\"N\",0,(IF(N145=\"P\",AA145)))))))))))))","v":0},{"$f":"IF(M145=\"\",0,(IF(T145=\"\",0,(IF(T145=\"N\",0,(IF(S145=\"Y\",0,(IF(BF145=\"N\",0,(IF(T145=\"Y\",(X145))))))))))))","v":0},{"$f":"IF(M145=\"\",0,(IF(T145=\"\",0,(IF(T145=\"Y\",0,(IF(S145=\"N\",0,(IF(BF145=\"N\",0,(IF(M145=\"P\",AA145)))))))))))","v":0},{"$f":"IF(N145=\"\",0,(IF(T145=\"\",0,(IF(T145=\"Y\",0,(IF(S145=\"N\",0, (IF(BF145=\"N\",0,(IF(N145=\"P\",AA145)))))))))))","v":0},{"$f":"IF(M145=\"\",0,(IF(T145=\"\",0,(IF(S145=\"N\",0,(IF(BF145=\"N\",0,(IF(T145=\"N\",0,(IF(T145=\"Y\",U145)))))))))))","v":0},{"$f":"IF(M145=\"\",0,(IF(T145=\"\",0,(IF(T145=\"Y\",0,(IF(S145=\"Y\",0,(IF(R145=\"N\",0,(IF(BF145=\"N\",0,(IF(M145=\"P\",AA145)))))))))))))","v":0},{"$f":"IF(N145=\"\",0,(IF(T145=\"\",0,(IF(T145=\"Y\",0,(IF(R145=\"N\",0, (IF(BF145=\"N\",0,(IF(N145=\"P\",AA145)))))))))))","v":0},{"$f":"IF(M145=\"\",0,(IF(BC145=\"N\",0,(IF(BD145=\"Y\",0,(IF(T145=\"Y\",0,(IF(BC145=\"E\",AA145,(IF(BC145=\"D\",AA145,(IF(BC145=\"O\",AA145,(IF(BC145=\"M\",AA145)))))))))))))))","v":0},{"$f":"IF(N145=\"\",0,(IF(BH145>0,0,(IF(BC145=\"N\",0,(IF(BD145=\"Y\",0,(IF(T145=\"Y\",0,(IF(BC145=\"E\",AA145,(IF(BC145=\"D\",AA145,(IF(BC145=\"O\",AA145,(IF(BC145=\"M\",AA145)))))))))))))))))","v":0},{"$f":"IF(M145=\"\",0,(IF(U145=\"\",0,(IF(BC145=\"N\",0,(IF(BD145=\"Y\",0,IF(T145=\"N\",0,(IF(BC145=\"E\",U145,(IF(BC145=\"D\",U145,(IF(BC145=\"O\",U145,(IF(BC145=\"M\",U145))))))))))))))))","v":0},{"$f":"(IF(M145=\"\",0,(IF(BE145=\"N\",0,(IF(BF145=\"Y\",0,(IF(BI145=0,0,(IF(BI145=\"\",\"\",(IF(Q145=\"Y\",0,(IF(R145=\"Y\",0,(IF(T145=\"Y\",0,(IF(BE145=\"Y\",AA145))))))))))))))))))","v":0},{"$f":"IF(N145=\"\",0,(IF(BE145=\"N\",0,(IF(BF145=\"Y\",0,(IF(BI145=0,0,(IF(BI145=\"\",0,(IF(Q145=\"Y\",0,(IF(R145=\"Y\",0,(IF(T145=\"Y\",0,(IF(BE145=\"Y\",AA145)))))))))))))))))","v":0},{"$f":"IF(M145=\"\",0,(IF(U145=\"\",0,(IF(T145=\"N\",0,(IF(BE145=\"N\",0,(IF(BF145=\"Y\",0,(IF(BE145=\"Y\",U145)))))))))))","v":0},{"$f":"(IF(M145=\"\",0,(IF(T145=\"Y\",0,(IF(S145=\"Y\",0,(IF(BD145=\"Y\",0,(IF(BE145=\"N\",0,(IF(BF145=\"Y\",0,(IF(BI145=0,0,(IF(BI145=\"\",\"\",(IF(R145=\"N\",0,(IF(R145=\"Y\",AA145))))))))))))))))))))+(IF(M145=\"\",0,(IF(R145=\"Y\",0,(IF(T145=\"Y\",0,(IF(S145=\"Y\",0,(IF(BD145=\"Y\",0,(IF(BE145=\"N\",0,(IF(BF145=\"Y\",0,(IF(BI145=0,0,(IF(BI145=\"\",\"\",(IF(Q145=\"Y\",AA145))))))))))))))))))))","v":0},{"$f":"(IF(N145=\"\",0,(IF(T145=\"\",0,(IF(T145=\"Y\",0,(IF(R145=\"N\",0, (IF(BF145=\"Y\",0,(IF(BE145=\"N\",0,(IF(BI145=0,0,(IF(BI145=\"\",\"\",(IF(R145=\"Y\",AA145))))))))))))))))))+(IF(N145=\"\",0,(IF(T145=\"\",0,(IF(T145=\"Y\",0,(IF(R145=\"Y\",0, (IF(BF145=\"Y\",0,(IF(BE145=\"N\",0,(IF(BI145=0,0,(IF(BI145=\"\",\"\",(IF(Q145=\"Y\",AA145))))))))))))))))))","v":0},{"$f":"(IF(M145=\"\",0,(IF(T145=\"Y\",0,(IF(BG145=\"Y\",0,(IF(BD145=\"N\",0,(IF(Q145=\"Y\",0,(IF(R145=\"Y\",0,(IF(BD145=\"Y\",AA145))))))))))))))","v":0},{"$f":"IF(N145=\"\",0,(IF(BD145=\"\",0,(IF(BD145=\"N\",0,(IF(BH145>0,0,(IF(T145=\"Y\",0,(IF(R145=\"Y\",0,(IF(Q145=\"Y\",0,(IF(BD145=\"Y\",AA145)))))))))))))))","v":0},{"$f":"IF(M145=\"\",0,(IF(BD145=\"\",0,(IF(BD145=\"N\",0,(IF(T145=\"N\",0,(IF(Q145=\"Y\",0,(IF(BD145=\"Y\",U145)))))))))))","v":0},{"$f":"(IF(M145=\"\",0,(IF(T145=\"\",0,(IF(T145=\"Y\",0,(IF(S145=\"Y\",0,(IF(R145=\"N\",0,(IF(BD145=\"N\",0,(IF(BE145=\"Y\",0,(IF(R145=\"Y\",AA145))))))))))))))))+(IF(R145=\"Y\",0,(IF(M145=\"\",0,(IF(BD145=\"N\",0,(IF(T145=\"\",0,(IF(T145=\"Y\",0,(IF(S145=\"Y\",0,(IF(BE145=\"Y\",0,(IF(Q145=\"Y\",AA145))))))))))))))))","v":0},{"$f":"(IF(N145=\"\",0,(IF(T145=\"\",0,(IF(T145=\"Y\",0,(IF(R145=\"N\",0,(IF(S145=\"Y\",0,(IF(BE145=\"Y\",0,(IF(BD145=\"N\",0,(IF(R145=\"Y\",AA145))))))))))))))))+(IF(R145=\"Y\",0,(IF(N145=\"\",0,(IF(T145=\"\",0,(IF(T145=\"Y\",0,(IF(S145=\"Y\",0,(IF(BE145=\"Y\",0,(IF(BD145=\"N\",0,(IF(Q145=\"Y\",AA145))))))))))))))))","v":0},{"$f":"IF(M145=\"\",0,(IF(BF145=\"Y\",0,(IF(BH145=\"\",0,(IF(BG145=\"N\",0,(IF(BH145=\"R\",0,(IF(BH145=\"S\",AA145)))))))))))","v":0},{"$f":"(IF(AW145=0,0,AW145))*3","v":0},{"$f":"IF(N145=\"\",0,(IF(BF145=\"Y\",0,(IF(BG145=\"N\",0,(IF(BH145=\"R\",0,(IF(BH145=\"S\",AA145)))))))))","v":0},{"$f":"IF(M145=\"\",0,(IF(BF145=\"Y\",0,(IF(BG145=\"N\",0,(IF(BH145=\"\",0,(IF(BH145=\"S\",0,(IF(BH145=\"R\",AA145)))))))))))","v":0},{"$f":"(IF(AZ145=0,0,AZ145))*2","v":0},{"$f":"IF(N145=\"\",0,(IF(BF145=\"Y\",0,(IF(BG145=\"N\",0,(IF(BH145=\"S\",0,(IF(BH145=\"R\",AA145)))))))))","v":0},null,null,null,null,null,null,null,null,null,null,null,null,null,null,null,null,{"$f":"IF(BK145=\"\",\"\",(BK145*12))","v":""},null,"",null,null,null,{"$f":"IF(BF145=\"\",\"\",(IF(BF145=\"N\",\"\",(IF(BF145=\"Y\",(IF(BN145=\"\",\"\",(IF($BN145<2,1,(IF($BN145<2.5,2,3))))*1.05)))))))","v":""},"",null,"",null,"",null,"",null,"","","","","",{"$f":"IF(BF145=\"\",\"\",(IF(BF145=\"N\",\"\",(IF(T145=\"Y\",\"Y\",(IF(AA145=\"\",\"Y\",(IF(AA145=0,\"\",(IF(BF145=\"Y\",(AB145+AC145+AE145+AF145+AH145+AI145))))))))))))","v":""},{"$f":"IF(BG145=\"\",\"\",(IF(BG145=\"N\",\"\",(IF(BF145=\"Y\",\"\",(IF(Q145=\"Y\",\"\",(IF(BG145=\"Y\",(AW145+AY145+AZ145+BB145))))))))))","v":""},{"$f":"(IF(BF145=\"Y\",\"\",(IF(BG145=\"Y\",\"\",(IF(AL145>0,\"\",(IF(T145=\"Y\",\"Y\",(IF(AA145=\"\",\"\",(IF(AJ145>0,BI145,(IF(AK145>0,BI145,(AM145+AN145+AR145+AS145+AU145+AV145+AP145+AQ145)))))))))))))))","v":""},{"$f":"(IF(AA145=\"\",\"\",(IF(M145=\"\",\"\",(IF(Q145=\"Y\",\"\",(IF(BG145=\"N\",\"\",(IF(BF145=\"Y\",\"\",(IF(BG145=\"Y\",(AX145+BA145)))))))))))))","v":""},{"$f":"IF(AT145=0,\"\",(IF(AQ145=\"Y\",\"\",(AT145))))","v":""},{"$f":"IF(AA145=\"\",\"\",(IF(Q145=\"Y\",\"\",(IF(AR145=0,\"\",(AR145))))))","v":""},{"$f":"IF(AO145=0,\"\",(IF(Q145=\"Y\",\"\",(AO145*2))))","v":""},{"$f":"IF(AM145=0,\"\",(IF(Q145=\"Y\",\"\",(AM145*2))))","v":""},{"$f":"(IF(AE145=0,\"\",(IF(Q145=\"Y\",\"\",(AE145*2)))))","v":""},{"$f":"IF(AD145=0,\"\",(IF(Q145=\"Y\",\"\",(AD145))))","v":""},{"$f":"IF(BN145=\"\",\"\",(IF(S145=\"Y\",\"\",(IF(R145=\"Y\",\"\",(IF(Q145=\"Y\",\"\",(IF(T145=\"Y\",\"\",(IF(BF145=\"\",\"\",(IF(BF145=\"N\",\"\",(CL145))))))))))))))","v":""},""]
[null,null,null,"Arid Areas (Badman 21/11/03)","Melaleuca xerophila",null,null,null,null,null,null,null,null,null,null,null,null,null,null,null,null,"",null,"",null,null,null,0,0,0,0,0,0,0,0,0,0,0,0,0,0,0,0,0,0,0,0,0,0,0,0,0,0,0,null,null,null,null,null,null,null,null,null,null,null,null,null,null,null,null,"",null,{"$f":"(IF(BT146=\"\",\"\",((BT146*50)^0.42)*0.64))","v":""},null,null,null,{"$f":"IF(BF146=\"\",\"\",(IF(BF146=\"N\",\"\",(IF(BF146=\"Y\",(IF(BN146=\"\",\"\",(IF($BN146<2.5,1,(IF($BN146<3,2,3))))*1.05)))))))","v":""},"",null,{"$f":"IF(CA146=\"\",\"\",(IF(BF146=\"N\",\"\",(IF(BF146=\"Y\",(CA146*1.45))))))","v":""},null,{"$f":"IF(CC146=\"\",\"\",(IF(BF146=\"N\",\"\",(IF(BF146=\"Y\",(CC146*0.65))))))","v":""},null,{"$f":"IF(CE146=\"\",\"\",(IF(BF146=\"N\",\"\",(IF(BF146=\"Y\",(CE146*0.4))))))","v":""},null,{"$f":"IF(CG146=\"\",\"\",(IF(BF146=\"N\",\"\",(IF(BF146=\"Y\",(CG146*0.35))))))","v":""},{"$f":"IF(BY146=\"\",\"\",(SUM(BY146,BZ146,CB146,CD146,CF146,CH146)*SUM(BY146,BZ146,CB146,CD146,CF146,CH146)*SUM(BY146,BZ146,CB146,CD146,CF146,CH146)/55.5))","v":""},{"$f":"IF(CI146=\"\",\"\",IF(CI146<30,0,(IF(CI146>=30,1))))","v":""},{"$f":"IF(CI146=\"\",\"\",(IF(CJ146=1,CJ146=\"@\",(IF(CJ146=0,(IF($CI146<20,4*$CI146/550,(IF($CI146<30,6*$CI146/550,(IF($CI146<41,8*$CI146/550,(IF($CI146<61,10*$CI146/550,12*$CI146/550)))))))))))))","v":""},"","","","","","","","","","","","",""]
[null,null,null,null,"Myoporum montanum",null,null,null,null,null,null,null,null,null,null,null,null,null,null,null,null,"",null,"",null,null,null,0,0,0,0,0,0,0,0,0,0,0,0,0,0,0,0,0,0,0,0,0,0,0,0,0,0,0,null,null,null,null,null,null,null,null,null,null,null,null,null,null,null,null,"",null,"",null,null,null,{"$f":"IF(BF147=\"\",\"\",(IF(BF147=\"N\",\"\",(IF(BF147=\"Y\",(IF(BN147=\"\",\"\",(IF($BN147<2,1,(IF($BN147<2.5,2,3))))*1.05)))))))","v":""},{"$f":"IF(BV147=\"\",\"\",(IF(BF147=\"N\",\"\",(IF(BF147=\"Y\",((100-$BV147)*0.04)+2)))))","v":""},null,"",null,"",null,"",null,"","","","","","","","","","","","","","","","",{"$f":"IF(BF147=\"\",\"\",(IF(BF147=\"N\",\"\",(IF(BP147=\"\",\"\",(IF(R147=\"Y\",\"\",(IF(T147=\"Y\",\"\",(IF($CY$6=\"\",\"\",(IF(AA147=\"\",\"\",(PI()*((BP147/2)*(BP147/2)))/10000*AA147)))))))))))))","v":""}]
[null,null,null,"Arid Areas","Myoporum montanum",null,null,null,null,null,null,null,null,null,null,null,null,null,null,null,null,"",null,"",null,null,null,0,0,0,0,0,0,0,0,0,0,0,0,0,0,0,0,0,0,0,0,0,0,0,0,0,0,0,null,null,null,null,null,null,null,null,null,null,null,null,null,null,null,null,"",null,"",null,null,null,{"$f":"IF(BF148=\"\",\"\",(IF(BF148=\"N\",\"\",(IF(BF148=\"Y\",(IF(BN148=\"\",\"\",(IF($BN148<1,1,(IF($BN148<4,2,3))))*1.05)))))))","v":""},"",null,"",null,"",null,"",null,"","","","","","","","","","","","","","","","",""]
[null,null,null,null,"Myoporum platycarpum",null,null,null,null,null,null,null,null,null,null,null,null,null,null,null,null,"",null,"",null,null,null,0,0,0,0,0,0,0,0,0,0,0,0,0,0,0,0,0,0,0,0,0,0,0,0,0,0,0,null,null,null,null,null,null,null,null,null,null,null,null,null,null,null,null,"",null,"",null,null,null,{"$f":"IF(BF149=\"\",\"\",(IF(BF149=\"N\",\"\",(IF(BF149=\"Y\",(IF(BN149=\"\",\"\",(IF($BN149<3.4,1,(IF($BN149<6.7,2,3))))*1.05)))))))","v":""},"",null,"",null,"",null,"",null,"","","","","","","","","","","","","","","","",""]
[null,null,null,"Arid Areas (Badman 21/11/03)","Owenia acidula",null,null,null,null,null,null,null,null,null,null,null,null,null,null,null,null,"",null,"",null,null,null,0,0,0,0,0,0,0,0,0,0,0,0,0,0,0,0,0,0,0,0,0,0,0,0,0,0,0,null,null,null,null,null,null,null,null,null,null,null,null,null,null,null,null,"",null,"",null,null,null,{"$f":"IF(BF150=\"\",\"\",(IF(BF150=\"N\",\"\",(IF(BF150=\"Y\",(IF(BN150=\"\",\"\",(IF($BN150<3,1,(IF($BN150<4.5,2,3))))*1.05)))))))","v":""},"",null,"",null,"",null,"",null,"","","","","","","","","","","","","","","","",""]
[null,null,null,null,"Pittosporum phylliraeoides",null,null,null,null,null,null,null,null,null,null,null,null,null,null,null,null,"",null,"",null,null,null,0,0,0,0,0,0,0,0,0,0,0,0,0,0,0,0,0,0,0,0,0,0,0,0,0,0,0,null,null,null,null,null,null,null,null,null,null,null,null,null,null,null,null,"",null,"",null,null,null,{"$f":"IF(BF151=\"\",\"\",(IF(BF151=\"N\",\"\",(IF(BF151=\"Y\",(IF(BN151=\"\",\"\",(IF($BN151<2.5,1,(IF($BN151<5,2,3))))*1.05)))))))","v":""},"",null,"",null,"",null,"",null,"","","","","","","","","","","","","","","","",""]
[null,null,null,"Arid Areas","Pittosporum phylliraeoides",null,null,null,null,null,null,null,null,null,null,null,null,null,null,null,null,"",null,"",null,null,null,0,0,0,0,0,0,0,0,0,0,0,0,0,0,0,0,0,0,0,0,0,0,0,0,0,0,0,null,null,null,null,null,null,null,null,null,null,null,null,null,null,null,null,"",null,"",null,null,null,{"$f":"IF(BF152=\"\",\"\",(IF(BF152=\"N\",\"\",(IF(BF152=\"Y\",(IF(BN152=\"\",\"\",(IF($BN152<2.5,1,(IF($BN152<9,2,3))))*1.05)))))))","v":""},"",null,"",null,"",null,"",null,"","","","","","","","","","","","","","","","",""]
[null,null,null,null,"Santalum acuminatum",null,null,null,null,null,null,null,null,null,null,null,null,null,null,null,null,"",null,"",null,null,null,0,0,0,0,0,0,0,0,0,0,0,0,0,0,0,0,0,0,0,0,0,0,0,0,0,0,0,null,null,null,null,null,null,null,null,null,null,null,null,null,null,null,null,"",null,"",null,null,null,{"$f":"IF(BF153=\"\",\"\",(IF(BF153=\"N\",\"\",(IF(BF153=\"Y\",(IF(BN153=\"\",\"\",(IF($BN153<2,1,(IF($BN153<3.5,2,3))))*1.05)))))))","v":""},"",null,"",null,"",null,"",null,"","","","","","","","","","","","","","","","",""]
[null,null,null,null,"Santalum lanceolatum",null,null,null,null,null,null,null,null,null,null,null,null,null,null,null,null,"",null,"",null,null,null,0,0,0,0,0,0,0,0,0,0,0,0,0,0,0,0,0,0,0,0,0,0,0,0,0,0,0,null,null,null,null,null,null,null,null,null,null,null,null,null,null,null,null,"",null,"",null,null,null,{"$f":"IF(BF154=\"\",\"\",(IF(BF154=\"N\",\"\",(IF(BF154=\"Y\",(IF(BN154=\"\",\"\",(IF($BN154<3,1,(IF($BN154<4.5,2,3))))*1.05)))))))","v":""},"",null,"",null,"",null,"",null,"","","","","","","","","","","","","","","","",""]
[null,null,null,"Arid Areas","Santalum lanceolatum",null,null,null,null,null,null,null,null,null,null,null,null,null,null,null,null,"",null,"",null,null,null,0,0,0,0,0,0,0,0,0,0,0,0,0,0,0,0,0,0,0,0,0,0,0,0,0,0,0,null,null,null,null,null,null,null,null,null,null,null,null,null,null,null,null,"",null,"",null,null,null,{"$f":"IF(BF155=\"\",\"\",(IF(BF155=\"N\",\"\",(IF(BF155=\"Y\",(IF(BN155=\"\",\"\",(IF($BN155<2,1,(IF($BN155<5.5,2,3))))*1.05)))))))","v":""},"",null,"",null,"",null,"",null,"","","","","","","","","","","","","","","","",""]
[null,null,null,"Arid Areas (Badman 21/11/03). \nRated Vulnerable - June 2014 - 20% loading added to SEB","Santalum spicatum",null,null,null,null,null,null,null,null,null,null,null,null,null,null,null,null,"",null,"",null,null,null,0,0,0,0,0,0,0,0,0,0,0,0,0,0,0,0,0,0,0,0,0,0,0,0,0,0,0,null,null,null,null,null,null,null,null,null,null,null,null,null,null,null,null,"",null,"",null,null,null,{"$f":"IF(BF156=\"\",\"\",(IF(BF156=\"N\",\"\",(IF(BF156=\"Y\",(IF(BN156=\"\",\"\",(IF($BN156<3.5,1,(IF($BN156<4.5,2,3))))*1.05)))))))","v":""},"",null,"",null,"",null,"",null,"","","","",{"$f":"IF(CI156=\"\",\"\",(((IF($CI156<20,4*$CI156/550,(IF($CI156<29.1,6*$CI156/550,(IF($CI156<40.1,8*$CI156/550,(IF($CI156<60.1,10*$CI156/550,12*$CI156/550))))))))*AA156))*120/100)","v":""},"","","","","","","","","","","",""]
[null,null,null,null,"Senna artemisioides nothospp. artemisioides",null,null,null,null,null,null,null,null,null,null,null,null,null,null,null,null,"",null,"",null,null,null,0,0,0,0,0,0,0,0,0,0,0,0,0,0,0,0,0,0,0,0,0,0,0,0,0,0,0,null,null,null,null,null,null,null,null,null,null,null,null,null,null,null,null,"",null,"",null,null,null,{"$f":"IF(BF157=\"\",\"\",(IF(BF157=\"N\",\"\",(IF(BF157=\"Y\",(IF(BN157=\"\",\"\",(IF($BN157<1.5,1,(IF($BN157<2,2,3))))*1.05)))))))","v":""},"",null,"",null,"",null,"",null,"","","","",{"$f":"IF(CI157=\"\",\"\",((IF($CI157<20,4*$CI157/550,(IF($CI157<29.1,6*$CI157/550,(IF($CI157<40.1,8*$CI157/550,(IF($CI157<60.1,10*$CI157/550,12*$CI157/550))))))))*AA157))","v":""},"","","","","","","","","","","",""]
[null,null,null,null,"Senna artemisioides nothospp. coriacea",null,null,null,null,null,null,null,null,null,null,null,null,null,null,null,null,"",null,"",null,null,null,0,0,0,0,0,0,0,0,0,0,0,0,0,0,0,0,0,0,0,0,0,0,0,0,0,0,0,null,null,null,null,null,null,null,null,null,null,null,null,null,null,null,null,"",null,"",null,null,null,{"$f":"IF(BF158=\"\",\"\",(IF(BF158=\"N\",\"\",(IF(BF158=\"Y\",(IF(BN158=\"\",\"\",(IF($BN158<1.5,1,(IF($BN158<2,2,3))))*1.05)))))))","v":""},"",null,"",null,"",null,"",null,"","","","","","","","","","","","","","","","",""]
[null,null,null,null,"Senna artemisioides nothospp. petiolaris",null,null,null,null,null,null,null,null,null,null,null,null,null,null,null,null,"",null,"",null,null,null,0,0,0,0,0,0,0,0,0,0,0,0,0,0,0,0,0,0,0,0,0,0,0,0,0,0,0,null,null,null,null,null,null,null,null,null,null,null,null,null,null,null,null,"",null,"",null,null,null,{"$f":"IF(BF159=\"\",\"\",(IF(BF159=\"N\",\"\",(IF(BF159=\"Y\",(IF(BN159=\"\",\"\",(IF($BN159<1.5,1,(IF($BN159<2,2,3))))*1.05)))))))","v":""},"",null,"",null,"",null,"",null,"","","","","","","","","","","","","","","","",""]
[null,null,null,null,"Senna artemisioides ssp. filifolia",null,null,null,null,null,null,null,null,null,null,null,null,null,null,null,null,"",null,"",null,null,null,0,0,0,0,0,0,0,0,0,0,0,0,0,0,0,0,0,0,0,0,0,0,0,0,0,0,0,null,null,null,null,null,null,null,null,null,null,null,null,null,null,null,null,"",null,"",null,null,null,{"$f":"IF(BF160=\"\",\"\",(IF(BF160=\"N\",\"\",(IF(BF160=\"Y\",(IF(BN160=\"\",\"\",(IF($BN160<1.5,1,(IF($BN160<2,2,3))))*1.05)))))))","v":""},"",null,"",null,"",null,"",null,"","","","","","","","","","","","","","","","",""]
[null,null,null,null,null,null,null,null,null,null,null,null,null,null,null,null,null,null,null,null,null,"",null,"",null,null,null,0,0,0,0,0,0,0,0,0,0,0,0,0,0,0,0,0,0,0,0,0,0,0,0,0,0,0,null,null,null,null,null,null,null,null,null,null,null,null,null,null,null,null,"",null,{"$f":"(IF(BT161=\"\",\"\",((BT161*50)^0.42)*0.64))","v":""},null,null,null,{"$f":"IF(BF161=\"\",\"\",(IF(BF161=\"N\",\"\",(IF(BF161=\"Y\",(IF(BN161=\"\",\"\",(IF($BN161<10,1,(IF($BN161<20,2,3))))*1.05)))))))","v":""},{"$f":"IF(BV161=\"\",\"\",(IF(BF161=\"N\",\"\",(IF(BF161=\"Y\",((100-$BV161)*0.04)+2)))))","v":""},null,{"$f":"IF(CA161=\"\",\"\",(IF(BF161=\"N\",\"\",(IF(BF161=\"Y\",(CA161*1.45))))))","v":""},null,{"$f":"IF(CC161=\"\",\"\",(IF(BF161=\"N\",\"\",(IF(BF161=\"Y\",(CC161*0.65))))))","v":""},null,{"$f":"IF(CE161=\"\",\"\",(IF(BF161=\"N\",\"\",(IF(BF161=\"Y\",(CE161*0.4))))))","v":""},null,{"$f":"IF(CG161=\"\",\"\",(IF(BF161=\"N\",\"\",(IF(BF161=\"Y\",(CG161*0.35))))))","v":""},{"$f":"IF(BY161=\"\",\"\",(SUM(BY161,BZ161,CB161,CD161,CF161,CH161)*SUM(BY161,BZ161,CB161,CD161,CF161,CH161)*SUM(BY161,BZ161,CB161,CD161,CF161,CH161)/55.5))","v":""},{"$f":"IF(CI161=\"\",\"\",IF(CI161<30,0,(IF(CI161>=30,1))))","v":""},{"$f":"IF(CI161=\"\",\"\",(IF(CJ161=1,CJ161=\"@\",(IF(CJ161=0,(IF($CI161<20,4*$CI161/550,(IF($CI161<30,6*$CI161/550,(IF($CI161<41,8*$CI161/550,(IF($CI161<61,10*$CI161/550,12*$CI161/550)))))))))))))","v":""},"","","","","","","","","","","","",""]
[null,null,null,null,null,null,null,null,null,null,null,null,null,null,null,null,null,null,null,null,null,"",null,"",null,null,null,0,0,0,0,0,0,0,0,0,0,0,0,0,0,0,0,0,0,0,0,0,0,0,0,0,0,0,null,null,null,null,null,null,null,null,null,null,null,null,null,null,null,null,"",null,"",null,null,null,"","",null,"",null,"",null,"",null,"","","","","","","","","","","","","","","","",""]
[null,null,null,null,null,null,null,null,null,null,null,null,null,null,null,null,null,null,null,null,null,"",null,"",null,null,null,0,0,0,0,0,0,0,0,0,0,0,0,0,0,0,0,0,0,0,0,0,0,0,0,0,0,0,null,null,null,null,null,null,null,null,null,null,null,null,null,null,null,null,"",null,"",null,null,null,"","",null,"",null,"",null,"",null,"","","","","","","","","","","","","","","","",""]
[null,null,null,null,null,null,null,null,null,null,null,null,null,null,null,null,null,null,null,null,null,"",null,"",null,null,null,0,0,0,0,0,0,0,0,0,0,0,0,0,0,0,0,0,0,0,0,0,0,0,0,0,0,0,null,null,null,null,null,null,null,null,null,null,null,null,null,null,null,null,"",null,"",null,null,null,"","",null,"",null,"",null,"",null,"","","","","","","","","","","","","","","","",""]
[null,null,null,null,null,null,null,null,null,null,null,null,null,null,null,null,null,null,null,null,null,"",null,"",null,null,null,0,0,0,0,0,0,0,0,0,0,0,0,0,0,0,0,0,0,0,0,0,0,0,0,0,0,0,null,null,null,null,null,null,null,null,null,null,null,null,null,null,null,null,"",null,"",null,null,null,"","",null,"",null,"",null,"",null,"","","","","","","","","","","","","","","","",""]
[null,null,null,null,null,null,null,null,null,null,null,null,null,null,null,null,null,null,null,null,null,"",null,"",null,null,null,0,0,0,0,0,0,0,0,0,0,0,0,0,0,0,0,0,0,0,0,0,0,0,0,0,0,0,null,null,null,null,null,null,null,null,null,null,null,null,null,null,null,null,"",null,"",null,null,null,"","",null,"",null,"",null,"",null,"","","","","","","","","","","","","","","","",""]
[null,null,null,null,null,null,null,null,null,null,null,null,null,null,null,null,null,null,null,null,null,"",null,"",null,null,null,0,0,0,0,0,0,0,0,0,0,0,0,0,0,0,0,0,0,0,0,0,0,0,0,0,0,0,null,null,null,null,null,null,null,null,null,null,null,null,null,null,null,null,"",null,"",null,null,null,"","",null,"",null,"",null,"",null,"","","","","","","","","","","","","","","","",""]
[null,null,null,null,null,null,null,null,null,null,null,null,null,null,null,null,null,null,null,null,null,"",null,"",null,null,null,0,0,0,0,0,0,0,0,0,0,0,0,0,0,0,0,0,0,0,0,0,0,0,0,0,0,0,null,null,null,null,null,null,null,null,null,null,null,null,null,null,null,null,"",null,"",null,null,null,"","",null,"",null,"",null,"",null,"","","","","","","","","","","","","","","","",""]
[null,null,null,null,null,null,null,null,null,null,null,null,null,null,null,null,null,null,null,null,null,"",null,"",null,null,null,0,0,0,0,0,0,0,0,0,0,0,0,0,0,0,0,0,0,0,0,0,0,0,0,0,0,0,null,null,null,null,null,null,null,null,null,null,null,null,null,null,null,null,"",null,"",null,null,null,"","",null,"",null,"",null,"",null,"","","","","","","","","","","","","","","","",""]
[null,null,null,null,null,null,null,null,null,null,null,null,null,null,null,null,null,null,null,null,null,"",null,"",null,null,null,0,0,0,0,0,0,0,0,0,0,0,0,0,0,0,0,0,0,0,0,0,0,0,0,0,0,0,null,null,null,null,null,null,null,null,null,null,null,null,null,null,null,null,"",null,"",null,null,null,"","",null,"",null,"",null,"",null,"","","","","","","","","","","","","","","","",""]
[null,null,null,null,null,null,null,null,null,null,null,null,null,null,null,null,null,null,null,null,null,"",null,"",null,null,null,0,0,0,0,0,0,0,0,0,0,0,0,0,0,0,0,0,0,0,0,0,0,0,0,0,0,0,null,null,null,null,null,null,null,null,null,null,null,null,null,null,null,null,"",null,"",null,null,null,"","",null,"",null,"",null,"",null,"","","","","","","","","","","","","","","","",""]

{"sheet":"Impact","index":3,"n_rows":40,"n_cols":110,"rows_kept":40,"cut":false,"hidden":false,"merged":[[0,19,1,19],[0,20,13,20],[0,21,13,21],[0,22,13,22],[0,23,2,23],[0,26,13,26],[3,23,4,23],[0,1,0,4],[0,6,0,11],[0,12,8,15],[0,16,1,16],[0,17,1,17],[0,18,1,18],[1,10,13,10],[1,11,13,11],[9,13,13,13],[9,14,13,14],[9,4,9,5],[9,12,13,12],[9,15,13,15],[11,4,13,4],[0,34,13,34],[0,35,13,35],[0,36,13,36],[0,37,13,37],[0,38,13,38],[0,27,13,27],[0,28,13,28],[0,29,13,29],[0,30,13,30],[0,31,13,31],[0,32,13,32],[0,33,13,33],[0,68,13,68],[0,51,13,51],[0,52,13,52],[0,53,13,53],[0,60,2,60],[0,61,13,61],[0,62,13,62],[1,54,13,54],[1,55,4,55],[1,56,4,56],[1,57,4,57],[5,56,13,56],[5,57,13,57],[5,58,13,58],[5,60,13,60],[1,59,13,59],[0,101,1,102],[0,103,0,105],[0,106,0,108],[0,109,13,109],[1,1,1,4],[1,6,13,6],[1,7,13,7],[1,8,13,8],[1,9,13,9],[0,69,4,69],[0,70,13,70],[0,71,13,71],[0,72,13,72],[0,86,1,89],[0,90,0,92],[1,91,13,91],[1,92,13,92],[2,82,13,82],[2,83,13,83],[0,63,13,63],[0,64,13,64],[0,65,13,65],[0,66,13,66],[0,67,13,67],[1,73,13,73],[1,74,13,74],[1,75,13,75],[1,90,13,90],[2,78,13,78],[2,79,13,79],[2,80,13,80],[2,81,13,81],[0,93,0,100],[2,86,13,86],[2,87,13,87],[2,88,10,88],[2,89,13,89],[11,88,12,88],[1,106,4,106],[1,107,4,107],[1,108,4,108],[2,1,3,4],[2,16,13,16],[2,17,13,17],[2,18,13,18],[2,19,13,19],[2,76,13,76],[2,77,13,77],[1,94,1,95],[1,96,1,97],[1,98,1,100],[1,103,4,103],[1,104,4,104],[1,105,4,105],[2,99,13,99],[2,100,5,100],[2,101,4,102],[1,58,4,58],[3,60,4,60],[4,1,6,4],[5,23,13,23],[5,55,13,55],[0,48,13,48],[0,49,13,49],[0,50,13,50],[0,39,13,39],[0,40,13,40],[0,41,13,41],[0,42,13,42],[0,43,13,43],[0,44,13,44],[11,101,13,102],[28,90,28,99],[28,101,28,102],[5,69,13,69],[6,100,7,100],[7,0,14,0],[7,1,15,1],[7,2,15,2],[7,4,7,5],[8,4,8,5],[8,24,13,24],[8,25,13,25],[8,100,13,100],[2,93,13,93],[2,94,13,94],[2,95,13,95],[2,96,13,96],[2,97,13,97],[2,98,13,98],[2,84,13,84],[2,85,13,85],[0,45,13,45],[0,46,13,46],[0,47,13,47],[34,101,34,102],[35,101,35,102],[36,101,36,102],[37,101,37,102],[38,101,38,102],[39,101,39,102],[29,101,29,102],[30,101,30,102],[31,90,31,99],[31,101,31,102],[32,101,32,102],[33,101,33,102]]}
[null,{"$f":"Main!A2","v":"DEPARTMENT OF PLANNING, TRANSPORT &  INFRASTRUCTURE"},null,null,null,null,"SAFETY",null,null,null,null,null,"IMPACT OR RECOMMENDED ACTION",null,null,null,"Y\nN","Y\nN","Y\nN","Y\nN","AREA of Vegetation to be Removed (m2) ","AREA TO BE REMOVED SUBJECT TO THE NVA","NVA SEB Multipliation Factor (Condition)",{"$f":"SUM($X30:$X31)","v":0},null,null,"NUMBER IN GROUP (Where an area has been used in lieu of individual counts, number is shown in red)","REMOVAL \nNumber of Native Veg","MAJOR PRUNE\nNumber of Native Veg","Area of Native Veg","Regulation 5(1)(lb)\nREMOVAL \nNumber of Native Veg","Regulation 5(1)(lb)\nMAJOR PRUNE\nNumber of Native Veg","Regulation 5(1)(lb)\nArea of Native Veg","STRUCTURALLY UNSOUND\nREMOVAL \nNumber of Native Veg","STRUCTURALLY UNSOUND\nMAJOR PRUNE\nNumber of Native Veg","REMOVAL\nNumber of weeds and \"others\" excluding amenity planting","MAJOR PRUNE\nNumber of weeds and \"others\" excluding amenity planting","AREA OF WEEDS EXCLUDING AMENITY","REMOVAL\nNumber - Native Vegetation Not covered by ACT","MAJOR PRUNE\nNumber - Native Vegetation Not covered by ACT","Area - Native Vegetation Not covered by ACT","STRUCTURALLY UNSOUND\nREMOVAL \nNumber - Native Vegetation Not covered by ACT","STRUCTURALLY UNSOUND\nMAJOR PRUNE\nNumber - Native Vegetation Not covered by ACT","REMOVAL\nNumber - Amenity Planting","MAJOR PRUNE\nNumber - Amenity Planting","Area - Amenity Planting","STRUCTURALLY UNSOUND\nREMOVAL \nNumber - Amenity Planting","STRUCTURALLY UNSOUND\nMAJOR PRUNE\nNumber - Amenity Planting","REMOVAL\nNumber - Regulated Significant Trees","OFF-SET\nNumber - Regulated Significant Trees","MAJOR PRUNE\nNumber - Regulated Significant Trees","REMOVAL\nNumber - Regulated Trees","OFF-SET\nNumber - Regulated Trees","MAJOR PRUNE\nNumber - Regulated Trees","A","B","C","D","E","F",{"$f":"SUM($BI$30:$BI$4950)","v":0},"SINGLE-STEMMED(S) OR  MULTI-STEMMED(MS) SPECIMEN","BUTT DIA (M). IN GROUP AND/OR MS SITUATIONS INSERT HIGHEST RANGE READING","BUTT DIA (M). ONLY USE THIS COLUMN IN A GROUP AND/OR MS SITUATION INSERT LOWEST  RANGE","CIRCUMFERENCE (M) DEVELOPMENT ACT REQUIREMENT ONLY","HEIGHT (M). IN GROUP SITUATIONS INSERT HIGHEST RANGE READING","HEIGHT  (M) . ONLY USE THIS COLUMN IN A GROUP SITUATION INSERTING LOWEST RANGE READING ","SPREAD (M). IN GROUP AND/OR MS SITUATIONS INSERT HIGHEST RANGE READING","SPREAD (M). ONLY USE THIS COLUMN IN A GROUP SITUATION INSERTING LOWEST RANGE READING ","VG\nG\nF\nP\nD","TREE PROTECTION ZONE (TPZ) - BUTT DIA. @ 1.4m x 12","TRUNK DIA. JUST ABOVE TREE BASE (m)","STRUCTURAL ROOT ZONE (SRZ) RADIUS (m)","NVA INFORMATION",null,null,null,null,null,null,null,null,null,null,null,null,"REVISION  5\nJULY 2012",null,null,null,"APPROVALS",null,null,"SET ASIDE",null,null,null,null,null,null,null,"Paying into NVC Fund Option",null,"Calculations for (NV) Scattered Tree Payment for each LGC",null,null,"Calculations for (NV) Area Payment for each LGC",null,null,"Comments"]
[null,{"$f":"Main!A3","v":"SAFETY & SERVICE DIVISION            Revision - August 2018"},null,null,null,null,"CLEARANCE ENVELOPE (S - Standard, R - Restricted)","SIDE OF ROAD (L - LEFT, R - RIGHT)","Width of the Travelway","Distance - Centreline to Edgeline","Distance of Tree from the Edgeline\n(Show in RED if behind Guardrailing)","Clearance @ Edgeline OR Edge of Envelope",null,null,null,null,null,null,null,null,null,null,null,null,null,null,null,null,null,null,null,null,null,null,null,null,null,null,null,null,null,null,null,null,null,null,null,null,null,null,null,null,null,null,"WEED SPECIES (N-no; D-declared; E-environmental)","Y\nN","Y\nN","Y\nN","Y\nN","NUMBER OF SIGNIFICANT TREES IN THE GROUP REQUIRING DAC APPROVAL",null,null,null,null,null,null,null,null,null,null,null,null,null,"%  DIEBACK","HOLLOWS (NUMBER)","HOLLOW ENTRANCE SIZE (METRES)",null,null,null,null,null,null,null,null,"VALUE",null,null,null,null,null,"NATIVE VEGETATION ACT (NVA)","DEVELOPMENT ACT (DAC)","DPTI VEGETATION REMOVAL POLICY","DAC","Amenity",null,"Native veg. not covered by NVA",null,"NVA",null,null,null,null,"Total Scattered tree SEB (ha) for each LGC","Total Canopy Area (ha) cleared for each LGC ","Payment into fund (Scattered trees) for each LGC","Total Area SEB (ha) for each LGC ","Total Area Cleared (ha) for each LGC ","Payment into fund (Area) for each LGC"]
[null,{"$f":"IF(Main!$E$4=\"\",\"\",Main!$E$4)","v":"VS 2017/???"},null,null,null,null,null,null,null,null,null,null,null,null,null,null,"Off-set is Negated","STRUCTURALLY UNSOUND TREE","REGULATION 5(1)(lb) APPLIES","Area reporting selected in lieu of individual reporting",null,null,null,null,"COLUMN \"A\"","COLUMN \"B\"",null,null,null,null,null,null,null,null,null,null,null,null,null,null,null,null,null,null,null,null,null,null,null,null,null,null,null,null,null,null,null,null,null,null,null,null,null,null,null,null,null,null,null,null,null,null,null,null,null,null,"1. HEIGHT (WEIGHTED)","2. HEALTH (WEIGHTED)","HOLLOWS 1, 2 OR 3 POINTS","3. HOLLOWS (WEIGHTED)","SUITABILITY FOR THREATENED SPECIES ","4. THREATENED SPECIES (WEIGHTED)","DENSITY","5. DENSITY  (WEIGHTED)","PROXIMITY TO OTHER VEG","6. PROXIMITY TO OTHER VEG. (WEIGHTED)","TOTAL SCORE","RECOMMENDATION","A 'FALSE' reading indicates Refusal under normal circumstances.","SEB Offset Area Requirement (total removal scattered trees)",null,null,null,"Number","Area (m2) - 1:1","Number of Plants - 1:1","Area (m2) - 2:1","Number of Plants - 2:1","Number - Regulation 5(1)(lb) Only - 2:1","Area (ha)\n(Condition Score x Area)","Total SEB amount for Area to be Removed (Ha)","LGC AVERAGE LAND VALUE "]
[null,null,null,null,null,null,null,null,null,null,null,null,null,null,null,null,null,null,null,null,null,null,null,"TOTAL",null,null,null,null,null,null,null,null,null,null,null,null,null,null,null,null,null,null,null,null,null,null,null,null,null,null,null,null,null,null,null,null,null,null,null,null,"TOTAL"]
[null,"IMPACT TABLE",null,null,null,null,null,null,null,null,null,null,null,null,null,null,null,null,null,null,null,null,null,null,{"$f":"(SUMIF($BC$29:$BC$4951,\"D\",$AA$29:$AA$4951))+(SUMIF($BC$29:$BC$4951,\"E\",$AA$29:$AA$4951))","v":0},{"$f":"(SUMIF($BD$29:$BD$4951,\"Y\",$AA$29:$AA$4951))","v":0}]
[null,null,null,null,null,null,null,null,null,null,null,null,null,null,null,null,null,null,null,null,null,null,null,"NVA SEB for AREA (HA)","COLUMN \"D\"","COLUMN \"E\"",null,null,null,null,null,null,null,null,null,null,null,null,null,null,null,null,null,null,null,null,null,null,null,null,null,null,null,null,null,"AMENITY PLANTING","NATIVE VEGETATION","SUBJECT TO NATIVE VEGETATION ACT","SUBJECT TO DEVELOPMENT ACT",null,"NO IN GROUP WITH BUTT DIA. 0.15+ OR MS 0.10+",null,null,null,null,null,null,null,null,"HEALTH & CONDITION *",null,null,null,null,null,null,null,null,null,null,null,null,null,null,null,null,null,null,null,null,null,null,null,null,null,null,null,null,null,null,null,1,11519,{"$f":"IF(CY6=\"\",\"\",(SUMIF(A30:A31,\"1\",CW30:CW31)+(SUMIF(A33:A34,\"1\",CW33:CW34)/100*20)))","v":0},{"$f":"IF(CY6=\"\",\"\",(SUMIF(A30:A31,\"1\",CX30:CX31)+(SUMIF(A33:A34,\"1\",CX33:CX34))))","v":0},{"$f":"IF(CY6=\"\",\"\",(($CZ$6*$CY$6)+(800*$DA$6)))","v":0},{"$f":"IF(CY6=\"\",\"\",(SUMIF(A30:A31,\"1\",CV30:CV31)))","v":0},{"$f":"IF(CY6=\"\",\"\",(SUMIF(A30:A31,\"1\",V30:V31)/10000))","v":0},{"$f":"IF(CY6=\"\",\"\",(($DC$6*$CY$6)+(800*$DD$6)))","v":0}]
[null,null,null,null,null,null,null,null,null,null,null,null,null,null,null,null,null,null,null,null,null,null,null,null,null,null,null,null,null,null,null,null,null,null,null,null,null,null,null,null,null,null,null,null,null,null,null,null,null,null,null,null,null,null,null,null,null,null,null,null,null,null,null,null,null,null,null,null,null,null,null,null,null,null,null,null,null,null,null,null,null,null,null,null,null,null,null,null,null,null,null,null,null,null,null,null,null,null,null,null,{"$f":"X1","v":0},2,null,{"$f":"IF(CY7=\"\",\"\",(SUMIF(A30:A31,\"2\",CW30:CW31)+(SUMIF(A33:A34,\"2\",CW33:CW34)/100*20)))","v":""},{"$f":"IF(CY7=\"\",\"\",(SUMIF(A30:A31,\"2\",CX30:CX31)+(SUMIF(A33:A34,\"2\",CX33:CX34))))","v":""},{"$f":"IF(CY7=\"\",\"\",(($CZ$7*$CY$7)+(800*$DA$7)))","v":""},{"$f":"IF(CY7=\"\",\"\",(SUMIF(A30:A31,\"2\",CV30:CV31)))","v":""},{"$f":"IF(CY7=\"\",\"\",(SUMIF(A30:A31,\"2\",V30:V31)/10000))","v":""},{"$f":"IF(CY7=\"\",\"\",(($DC$7*$CY$7)+(800*$DD$7)))","v":""}]
["LGC\n(ALLOCATED NUMBER)","PLAN REFERENCE OR MM LOCATION","PHOTO REFERENCE",null,{"$f":"Main!$F$2","v":"Project Name: "},null,null,null,null,null,null,null,null,null,null,null,null,null,null,null,null,null,null,null,{"$f":"(SUMIF($BF$29:$BF$4951,\"Y\",$AA$29:$AA$4951))","v":0},{"$f":"SUMIF($BG$29:$BG$4951,\"Y\",$BH$29:$BH$4951)","v":0},null,null,null,null,null,null,null,null,null,null,null,null,null,null,null,null,null,null,null,null,null,null,null,null,null,null,null,null,null,null,null,null,null,null,null,null,null,null,null,null,null,null,null,null,null,null,null,null,null,null,null,null,null,null,null,null,null,null,null,null,null,null,null,null,null,null,null,null,null,null,null,null,null,null,{"$f":"(SUMIF(#REF!,\"Y\",CW55:CW56))/10000","v":{"$error":"#REF!"}},3,null,{"$f":"IF(CY8=\"\",\"\",(SUMIF(A30:A31,\"3\",CW30:CW31)+(SUMIF(A33:A34,\"3\",CW33:CW34)/100*20)))","v":""},{"$f":"IF(CY8=\"\",\"\",(SUMIF(A30:A31,\"3\",CX30:CX31)+(SUMIF(A33:A34,\"3\",CX33:CX34))))","v":""},{"$f":"IF(CY8=\"\",\"\",(($CZ$8*$CY$8)+(800*$DA$8)))","v":""},{"$f":"IF(CY8=\"\",\"\",(SUMIF(A30:A31,\"3\",CV30:CV31)))","v":""},{"$f":"IF(CY8=\"\",\"\",(SUMIF(A30:A31,\"3\",V30:V31)/10000))","v":""},{"$f":"IF(CY8=\"\",\"\",(($DC$8*$CY$8)+(800*$DD$8)))","v":""}]
[null,null,null,null,{"$f":"Main!$F$3","v":"Road Number : "},null,null,null,null,null,null,null,null,null,null,null,null,null,null,null,null,null,null,null,"EASTING","NORTHING",null,null,null,null,null,null,null,null,null,null,null,null,null,null,null,null,null,null,null,null,null,null,null,null,null,null,null,null,null,null,null,null,null,null,null,null,null,null,null,null,null,null,null,null,null,null,null,null,null,null,null,null,null,null,null,null,null,null,null,null,null,null,null,null,null,null,null,null,null,null,null,null,null,null,"SEB Offset Area Requirement for Scattered Trees (Ha)",4,null,{"$f":"IF(CY9=\"\",\"\",(SUMIF(A30:A31,\"4\",CW30:CW31)+(SUMIF(A33:A34,\"4\",CW33:CW34)/100*20)))","v":""},{"$f":"IF(CY9=\"\",\"\",(SUMIF(A30:A31,\"4\",CX30:CX31)+(SUMIF(A33:A34,\"4\",CX33:CX34))))","v":""},{"$f":"IF(CY9=\"\",\"\",(($CZ$9*$CY$9)+(800*$DA$9)))","v":""},{"$f":"IF(CY9=\"\",\"\",(SUMIF(A30:A31,\"4\",CV30:CV31)))","v":""},{"$f":"IF(CY9=\"\",\"\",(SUMIF(A30:A31,\"4\",V30:V31)/10000))","v":""},{"$f":"IF(CY9=\"\",\"\",(($DC$9*$CY$9)+(800*$DD$9)))","v":""}]
[null,null,null,null,{"$f":"Main!$F$4","v":"Location :"},null,null,null,null,null,null,null,"REMOVAL","MAJOR PRUNE","MINOR PRUNE","MONITOR",null,null,null,null,null,null,null,null,null,null,null,null,null,null,null,null,null,null,null,null,null,null,null,null,null,null,null,null,null,null,null,null,null,null,null,null,null,null,null,null,null,null,null,null,null,null,null,null,null,null,null,null,null,null,null,null,null,null,null,null,null,null,null,null,null,null,null,null,null,null,null,null,null,null,null,null,null,null,null,null,null,null,null,null,null,5,null,{"$f":"IF(CY10=\"\",\"\",(SUMIF(A30:A31,\"5\",CW30:CW31)+(SUMIF(A33:A34,\"5\",CW33:CW34)/100*20)))","v":""},{"$f":"IF(CY10=\"\",\"\",(SUMIF(A30:A31,\"5\",CX30:CX31)+(SUMIF(A33:A34,\"5\",CX33:CX34))))","v":""},{"$f":"IF(CY10=\"\",\"\",(($CZ$10*$CY$10)+(800*$DA$10)))","v":""},{"$f":"IF(CY10=\"\",\"\",(SUMIF(A30:A31,\"5\",CV30:CV31)))","v":""},{"$f":"IF(CY10=\"\",\"\",(SUMIF(A30:A31,\"5\",V30:V31)/10000))","v":""},{"$f":"IF(CY10=\"\",\"\",(($DC$10*$CY$10)+(800*$DD$10)))","v":""}]
[null,null,null,null,null,null,null,null,null,null,null,null,null,null,null,null,null,null,null,null,null,null,null,null,null,null,null,null,null,null,null,null,null,null,null,null,null,null,null,null,null,null,null,null,null,null,null,null,null,null,null,null,null,null,null,null,null,null,null,null,null,null,null,null,null,null,null,null,null,null,null,null,null,null,null,null,null,null,null,null,null,null,null,null,null,null,null,null,null,null,null,null,null,null,null,null,null,null,null,null,null,6,null,{"$f":"IF(CY11=\"\",\"\",(SUMIF(A30:A31,\"6\",CW30:CW31)+(SUMIF(A33:A34,\"6\",CW33:CW34)/100*20)))","v":""},{"$f":"IF(CY11=\"\",\"\",(SUMIF(A30:A31,\"6\",CX30:CX31)+(SUMIF(A33:A34,\"6\",CX33:CX34))))","v":""},{"$f":"IF(CY11=\"\",\"\",(($CZ$11*$CY$11)+(800*$DA$11)))","v":""},{"$f":"IF(CY11=\"\",\"\",(SUMIF(A30:A31,\"6\",CV30:CV31)))","v":""},{"$f":"IF(CY11=\"\",\"\",(SUMIF(A30:A31,\"6\",V30:V31)/10000))","v":""},{"$f":"IF(CY11=\"\",\"\",(($DC$11*$CY$11)+(800*$DD$11)))","v":""}]
[null,null,null,null,"Date : ???",null,null,null,null,null,null,null,null,null,null,null,null,null,null,null,null,null,null,null,null,null,null,null,null,null,null,null,null,null,null,null,null,null,null,null,null,null,null,null,null,null,null,null,null,null,null,null,null,null,null,null,null,null,null,null,null,null,null,null,null,null,null,null,null,null,null,null,null,null,null,null,null,null,null,null,null,null,null,null,null,null,null,null,"Number \"False\"",null,null,null,null,null,null,null,null,null,null,null,null,"CANOPY AREAS (SCATTERED TREES)",null,{"$f":"SUM(CZ5:CZ11)","v":0},0,0,0,0,0]
[]
[null,null,null,null,null,null,null,null,null,null,null,null,null,null,null,null,null,null,null,null,null,null,null,null,null,null,null,null,null,null,null,null,null,null,null,null,null,null,null,null,null,null,null,null,null,null,null,null,null,null,null,null,null,null,null,null,null,null,null,null,null,null,null,null,null,null,null,null,null,null,null,null,null,null,null,null,null,null,null,null,null,null,null,null,null,null,null,null,{"$f":"SUMIF(CK16:CK4891,\"FALSE\",AA16:AA4891)","v":0}]
[null,null,null,null,null,null,null,null,null,null,null,null,0.9]
[null,null,null,null,null,null,null,null,null,null,null,null,null,null,null,null,null,null,null,null,null,null,null,null,null,null,null,null,null,null,null,null,null,null,null,null,null,null,null,null,null,null,null,null,null,null,null,null,null,null,null,null,null,null,null,null,null,null,null,null,null,null,null,null,null,null,null,null,null,null,null,null,null,null,null,null,null,null,null,null,null,"F",null,"MV"]
[null,null,null,null,null,null,null,null,null,null,null,null,null,null,null,null,null,null,null,null,null,"Native Veg     Removals",null,null,null,null,{"$f":"SUM(AB30:AB31)","v":0},null,null,null,"TOTAL 5(1)(lb) Removals",{"$f":"SUM(AE30:AE31)","v":0},null,{"$f":"SUM(AH30:AH31)","v":0},"TOTAL - Removals - Structurally Unsound/Clearance Envelope -  NVA",null,null,null,null,null,null,null,null,null,null,null,null,null,null,null,null,null,"TOTAL DAC Removal - Regulated Trees",{"$f":"SUM(AZ30:AZ31)","v":0},null,null,null,null,null,null,null,null,null,null,null,null,null,null,null,null,null,null,null,null,null,null,null,null,null,null,null,null,null,null,null,null,null,null,null,null,null,null,null,null,null,null,null,null,null,null,{"$f":"CW32","v":0}]
[null,null,null,null,null,null,null,null,null,null,null,null,null,null,null,null,null,null,null,null,null,"Major Prune",null,null,null,null,{"$f":"SUM(AC33:AC34)","v":0},null,null,null,"TOTAL 5(1)(lb) Major Prune",{"$f":"SUM(AF33:AF34)","v":0},null,{"$f":"SUM(AI33:AI34)","v":0},"TOTAL - Major Prunes - Structurally Structurally Unsound/Clearance Envelope -  NVA",null,null,null,null,null,null,null,null,null,null,null,null,null,null,null,null,null,"TOTAL DAC Major Prune - Regulated Trees",{"$f":"SUM(BB33:BB34)","v":0}]
[null,null,null,null,null,null,null,null,null,null,null,null,null,null,null,null,null,null,null,null,null,"Area",null,null,null,null,{"$f":"SUM(V30:V31)/10000","v":0},null,null,null,"TOTAL 5(1)(lb) Area",{"$f":"SUM(AG33:AG34)","v":0},null,null,null,null,null,null,null,null,null,null,null,null,null,null,null,null,null,null,null,null,"TOTAL DAC Removal - Regulated Significant Trees",{"$f":"SUM(AW30:AW31)","v":0}]
[null,null,null,null,null,null,null,null,null,null,null,null,null,null,null,null,null,null,null,null,null,"Environmental Weeds     Removals","Number requiring approval",null,null,null,{"$f":"SUMIF(AJ30:AJ31,\">0\",BI30:BI31)","v":0},{"$f":"(SUMIF(AJ30:AJ31,\">0\",AA30:AA31))-(SUMIF(AJ30:AJ31,\">0\",BI30:BI31))","v":0},"Undersize Removals (no approval)",null,null,null,null,null,null,null,null,null,null,null,null,null,null,null,null,null,null,null,null,null,null,null,"TOTAL DAC Major Prune - Regulated Significant Trees",{"$f":"SUM(AY33:AY34)","v":0}]
[null,null,null,null,null,null,null,null,null,null,null,null,null,null,null,null,null,null,null,null,null,"Major Prune","Number requiring approval",null,null,null,{"$f":"SUMIF(AK33:AK34,\">0\",BI33:BI34)","v":0},{"$f":"(SUMIF(AK33:AK34,\">0\",AA33:AA34))-(SUMIF(AK33:AK34,\">0\",BI33:BI34))","v":0},"Undersize Major Prunes (no approval)"]
[null,null,null,null,null,null,null,null,null,null,null,null,null,null,null,null,null,null,null,null,null,"Area",null,null,null,null,{"$f":"SUM(AL30:AL31)","v":0},null,null,null,null,null,null,null,null,null,null,null,null,null,null,null,null,null,null,null,null,null,null,null,null,null,"TOTAL DAC Offset - Regulated  Significant Trees",{"$f":"SUM(AX30:AX31)","v":0}]
[null,null,null,null,null,null,null,null,null,null,null,null,null,null,null,null,null,null,null,null,null,"Amenity     Removals",null,null,null,null,{"$f":"SUM(AR30:AR31)","v":0},null,null,null,null,null,null,{"$f":"SUM(AU30:AU31)","v":0},"TOTAL - Removals - Structurally Unsound - Amenity",null,null,null,null,null,null,null,null,null,null,null,null,null,null,null,null,null,"TOTAL DAC Offset - Regulated Trees",{"$f":"SUM(BA30:BA31)","v":0}]
[null,null,null,null,null,null,null,null,null,null,null,null,null,null,null,null,null,null,null,null,null,"Major Prune",null,null,null,null,{"$f":"SUM(AS33:AS34)","v":0},null,null,null,null,null,null,{"$f":"SUM(AV33:AV34)","v":0},"TOTAL - Major Prunes - Structurally Unsound -Amenity"]
[null,null,null,null,null,null,null,null,null,null,null,null,null,null,null,null,null,null,null,null,null,"Area",null,null,null,null,{"$f":"SUM(AT30:AT31)","v":0}]
[null,null,null,null,null,null,null,null,null,null,null,null,null,null,null,null,null,null,null,null,null,"Native veg not covered by Act     Removals",null,null,null,null,{"$f":"SUM(AM30:AM31)","v":0},null,null,null,null,null,null,{"$f":"SUM(AP30:AP31)","v":0},"TOTAL - Removals - Structurally Unsound native veg not covered by NVA",null,null,null,null,null,null,null,null,null,null,null,null,null,null,null,null,null,"TOTAL Trees to be Monitored",{"$f":"SUM(AA39:AA40)","v":0}]
[null,null,null,null,null,null,null,null,null,null,null,null,null,null,null,null,null,null,null,null,null,"Major Prune",null,null,null,null,{"$f":"SUM(AN33:AN34)","v":0},null,null,null,null,null,null,{"$f":"SUM(AQ33:AQ34)","v":0},"TOTAL - Major Prunes - Structurally Unsound native veg not covered by NVA"]
[null,null,null,null,null,null,null,null,null,null,null,null,null,null,null,null,null,null,null,null,null,"Area",null,null,null,null,{"$f":"SUM(AO30:AO31)","v":0}]
[null,null,null,"jjjjj","REMOVALS",null,null,null,null,null,null,null,null,null,null,null,null,null,null,null,null,null,null,null,null,null,null,null,null,null,null,null,null,null,null,null,null,null,null,null,null,null,null,null,null,null,null,null,null,null,null,null,null,null,null,null,null,null,null,null,null,null,null,null,null,null,null,null,null,null,null,null,null,null,null,null,null,null,null,null,null,null,null,null,null,null,null,null,null,null,"Combined SEB for Removals\n(NVA Scattered Tree Scores)",null,null,null,null,null,null,null,null,null,{"$f":"SUM(CW30:CW31)","v":0}]
[null,null,null,null,null,null,null,null,null,null,null,null,null,null,null,null,null,null,null,null,null,{"$f":"IF(BF30=\"\",\"\",(IF(U30=\"\",\"\",(IF(BF30=\"N\",\"\",(IF(BF30=\"Y\",U30)))))))","v":""},null,{"$f":"IF(V30=\"\",\"\",(IF(BF30=\"N\",\"\",((V30*W30)/10000))))","v":""},null,null,null,{"$f":"IF(M30=\"\",0,(IF(T30=\"\",0,(IF(T30=\"Y\",0,(IF(S30=\"Y\",0, (IF(R30=\"Y\",0,(IF(BF30=\"N\",0,(IF(M30=\"P\",AA30)))))))))))))","v":0},{"$f":"IF(N30=\"\",0,(IF(T30=\"\",0,(IF(T30=\"Y\",0,(IF(S30=\"Y\",0, (IF(R30=\"Y\",0,(IF(BF30=\"N\",0,(IF(N30=\"P\",AA30)))))))))))))","v":0},{"$f":"IF(M30=\"\",0,(IF(T30=\"\",0,(IF(T30=\"N\",0,(IF(S30=\"Y\",0,(IF(BF30=\"N\",0,(IF(T30=\"Y\",(X30))))))))))))","v":0},{"$f":"IF(M30=\"\",0,(IF(T30=\"\",0,(IF(T30=\"Y\",0,(IF(S30=\"N\",0,(IF(BF30=\"N\",0,(IF(M30=\"P\",AA30)))))))))))","v":0},{"$f":"IF(N30=\"\",0,(IF(T30=\"\",0,(IF(T30=\"Y\",0,(IF(S30=\"N\",0, (IF(BF30=\"N\",0,(IF(N30=\"P\",AA30)))))))))))","v":0},{"$f":"IF(M30=\"\",0,(IF(T30=\"\",0,(IF(S30=\"N\",0,(IF(BF30=\"N\",0,(IF(T30=\"N\",0,(IF(T30=\"Y\",U30)))))))))))","v":0},{"$f":"IF(M30=\"\",0,(IF(T30=\"\",0,(IF(T30=\"Y\",0,(IF(S30=\"Y\",0,(IF(R30=\"N\",0,(IF(BF30=\"N\",0,(IF(M30=\"P\",AA30)))))))))))))","v":0},{"$f":"IF(N30=\"\",0,(IF(T30=\"\",0,(IF(T30=\"Y\",0,(IF(R30=\"N\",0, (IF(BF30=\"N\",0,(IF(N30=\"P\",AA30)))))))))))","v":0},{"$f":"IF(M30=\"\",0,(IF(BC30=\"N\",0,(IF(BD30=\"Y\",0,(IF(T30=\"Y\",0,(IF(BC30=\"E\",AA30,(IF(BC30=\"D\",AA30,(IF(BC30=\"O\",AA30,(IF(BC30=\"M\",AA30)))))))))))))))","v":0},{"$f":"IF(N30=\"\",0,(IF(BH30>0,0,(IF(BC30=\"N\",0,(IF(BD30=\"Y\",0,(IF(T30=\"Y\",0,(IF(BC30=\"E\",AA30,(IF(BC30=\"D\",AA30,(IF(BC30=\"O\",AA30,(IF(BC30=\"M\",AA30)))))))))))))))))","v":0},{"$f":"IF(M30=\"\",0,(IF(U30=\"\",0,(IF(BC30=\"N\",0,(IF(BD30=\"Y\",0,IF(T30=\"N\",0,(IF(BC30=\"E\",U30,(IF(BC30=\"D\",U30,(IF(BC30=\"O\",U30,(IF(BC30=\"M\",U30))))))))))))))))","v":0},{"$f":"(IF(M30=\"\",0,(IF(BE30=\"N\",0,(IF(BF30=\"Y\",0,(IF(Q30=\"Y\",0,(IF(R30=\"Y\",0,(IF(T30=\"Y\",0,(IF(BE30=\"Y\",AA30))))))))))))))","v":0},{"$f":"IF(N30=\"\",0,(IF(AA30=\"\",0,(IF(BE30=\"N\",0,(IF(BF30=\"Y\",0,(IF(BH30>0,0,(IF(R30=\"Y\",0,(IF(T30=\"Y\",0,(IF(BE30=\"Y\",AA30)))))))))))))))","v":0},{"$f":"IF(M30=\"\",0,(IF(U30=\"\",0,(IF(T30=\"N\",0,(IF(BE30=\"N\",0,(IF(BF30=\"Y\",0,(IF(BE30=\"Y\",U30)))))))))))","v":0},{"$f":"(IF(M30=\"\",0,(IF(T30=\"Y\",0,(IF(S30=\"Y\",0,(IF(BD30=\"Y\",0,(IF(BF30=\"Y\",0,(IF(R30=\"N\",0,(IF(M30=\"P\",AA30))))))))))))))+(IF(M30=\"\",0,(IF(R30=\"Y\",0,(IF(T30=\"Y\",0,(IF(S30=\"Y\",0,(IF(BD30=\"Y\",0,(IF(BF30=\"Y\",0,(IF(Q30=\"Y\",AA30))))))))))))))","v":0},{"$f":"IF(N30=\"\",0,(IF(T30=\"\",0,(IF(T30=\"Y\",0,(IF(R30=\"N\",0, (IF(BF30=\"Y\",0,(IF(BE30=\"N\",0,(IF(N30=\"P\",AA30)))))))))))))","v":0},{"$f":"(IF(M30=\"\",0,(IF(T30=\"Y\",0,(IF(BG30=\"Y\",0,(IF(BD30=\"N\",0,(IF(Q30=\"Y\",0,(IF(R30=\"Y\",0,(IF(BD30=\"Y\",AA30))))))))))))))","v":0},{"$f":"IF(N30=\"\",0,(IF(BD30=\"\",0,(IF(BD30=\"N\",0,(IF(BH30>0,0,(IF(T30=\"Y\",0,(IF(R30=\"Y\",0,(IF(BD30=\"Y\",AA30)))))))))))))","v":0},{"$f":"IF(M30=\"\",0,(IF(BD30=\"\",0,(IF(BD30=\"N\",0,(IF(T30=\"N\",0,(IF(Q30=\"Y\",0,(IF(BD30=\"Y\",U30)))))))))))","v":0},{"$f":"(IF(M30=\"\",0,(IF(T30=\"\",0,(IF(T30=\"Y\",0,(IF(S30=\"Y\",0,(IF(R30=\"N\",0,(IF(BE30=\"Y\",0,(IF(M30=\"P\",AA30))))))))))))))+(IF(R30=\"Y\",0,(IF(M30=\"\",0,(IF(T30=\"\",0,(IF(T30=\"Y\",0,(IF(S30=\"Y\",0,(IF(BE30=\"Y\",0,(IF(Q30=\"Y\",AA30))))))))))))))","v":0},{"$f":"IF(N30=\"\",0,(IF(T30=\"\",0,(IF(T30=\"Y\",0,(IF(R30=\"N\",0, (IF(BE30=\"Y\",0,(IF(BD30=\"N\",0,(IF(N30=\"P\",AA30)))))))))))))","v":0},{"$f":"IF(M30=\"\",0,(IF(BF30=\"Y\",0,(IF(BH30=\"\",0,(IF(BG30=\"N\",0,(IF(BH30=\"R\",0,(IF(BH30=\"S\",AA30)))))))))))","v":0},{"$f":"(IF(AW30=0,0,AW30))*3","v":0},{"$f":"IF(N30=\"\",0,(IF(BF30=\"Y\",0,(IF(BG30=\"N\",0,(IF(BH30=\"R\",0,(IF(BH30=\"S\",AA30)))))))))","v":0},{"$f":"IF(M30=\"\",0,(IF(BF30=\"Y\",0,(IF(BG30=\"N\",0,(IF(BH30=\"\",0,(IF(BH30=\"S\",0,(IF(BH30=\"R\",AA30)))))))))))","v":0},{"$f":"(IF(AZ30=0,0,AZ30))*2","v":0},{"$f":"IF(N30=\"\",0,(IF(BF30=\"Y\",0,(IF(BG30=\"N\",0,(IF(BH30=\"S\",0,(IF(BH30=\"R\",AA30)))))))))","v":0},null,null,null,null,null,null,null,null,null,null,null,null,null,null,null,null,null,null,{"$f":"(IF(BT30=\"\",\"\",((BT30*50)^0.42)*0.64))","v":""},null,null,null,{"$f":"IF(BF30=\"\",\"\",(IF(BF30=\"N\",\"\",(IF(BF30=\"Y\",(IF(BN30=\"\",\"\",(IF($BN30<10,1,(IF($BN30<20,2,3))))*1.05)))))))","v":""},{"$f":"IF(BV30=\"\",\"\",(IF(BF30=\"N\",\"\",(IF(BF30=\"Y\",((100-$BV30)*0.04)+2)))))","v":""},null,{"$f":"IF(CA30=\"\",\"\",(IF(BF30=\"N\",\"\",(IF(BF30=\"Y\",(CA30*1.45))))))","v":""},null,{"$f":"IF(CC30=\"\",\"\",(IF(BF30=\"N\",\"\",(IF(BF30=\"Y\",(CC30*0.65))))))","v":""},null,{"$f":"IF(CE30=\"\",\"\",(IF(BF30=\"N\",\"\",(IF(BF30=\"Y\",(CE30*0.4))))))","v":""},null,{"$f":"IF(CG30=\"\",\"\",(IF(BF30=\"N\",\"\",(IF(BF30=\"Y\",(CG30*0.35))))))","v":""},{"$f":"IF(BY30=\"\",\"\",(SUM(BY30,BZ30,CB30,CD30,CF30,CH30)*SUM(BY30,BZ30,CB30,CD30,CF30,CH30)*SUM(BY30,BZ30,CB30,CD30,CF30,CH30)/55.5))","v":""},{"$f":"IF(CI30=\"\",\"\",IF(CI30<30,0,(IF(CI30>=30,1))))","v":""},{"$f":"IF(CI30=\"\",\"\",(IF(CJ30=1,CJ30=\"@\",(IF(CJ30=0,(IF($CI30<20,4*$CI30/550,(IF($CI30<30,6*$CI30/550,(IF($CI30<41,8*$CI30/550,(IF($CI30<61,10*$CI30/550,12*$CI30/550)))))))))))))","v":""},{"$f":"IF(CI30=\"\",\"\",((IF($CI30<20,4*$CI30/550,(IF($CI30<29.1,6*$CI30/550,(IF($CI30<40.1,8*$CI30/550,(IF($CI30<60.1,10*$CI30/550,12*$CI30/550))))))))*AA30))","v":""},{"$f":"IF(BF30=\"\",\"\",(IF(BF30=\"N\",\"\",(IF(T30=\"Y\",\"Y\",(IF(AA30=\"\",\"Y\",(IF(AA30=0,\"\",(IF(BF30=\"Y\",(AB30+AC30+AE30+AF30+AH30+AI30))))))))))))","v":""},{"$f":"IF(BG30=\"\",\"\",(IF(BG30=\"N\",\"\",(IF(BF30=\"Y\",\"\",(IF(Q30=\"Y\",\"\",(IF(BG30=\"Y\",(AW30+AY30+AZ30+BB30))))))))))","v":""},{"$f":"(IF(BF30=\"Y\",\"\",(IF(BG30=\"Y\",\"\",(IF(AL30>0,\"\",(IF(T30=\"Y\",\"Y\",(IF(AA30=\"\",\"\",(IF(AJ30>0,BI30,(IF(AK30>0,BI30,(AM30+AN30+AR30+AS30+AU30+AV30+AP30+AQ30)))))))))))))))","v":""},{"$f":"(IF(AA30=\"\",\"\",(IF(M30=\"\",\"\",(IF(Q30=\"Y\",\"\",(IF(BG30=\"N\",\"\",(IF(BF30=\"Y\",\"\",(IF(BG30=\"Y\",(AX30+BA30)))))))))))))","v":""},{"$f":"IF(AT30=0,\"\",(IF(AQ30=\"Y\",\"\",(AT30))))","v":""},{"$f":"IF(AA30=\"\",\"\",(IF(Q30=\"Y\",\"\",(IF(AR30=0,\"\",(AR30))))))","v":""},{"$f":"IF(AO30=0,\"\",(IF(Q30=\"Y\",\"\",(AO30*2))))","v":""},{"$f":"IF(AM30=0,\"\",(IF(Q30=\"Y\",\"\",(AM30*2))))","v":""},{"$f":"(IF(AE30=0,\"\",(IF(Q30=\"Y\",\"\",(AE30*2)))))","v":""},{"$f":"IF(AD30=0,\"\",(IF(Q30=\"Y\",\"\",(AD30))))","v":""},{"$f":"IF(BN30=\"\",\"\",(IF(S30=\"Y\",\"\",(IF(R30=\"Y\",\"\",(IF(Q30=\"Y\",\"\",(IF(T30=\"Y\",\"\",(IF(BF30=\"\",\"\",(IF(BF30=\"N\",\"\",(CL30))))))))))))))","v":""},{"$f":"IF(BF30=\"\",\"\",(IF(BF30=\"N\",\"\",(IF(BP30=\"\",\"\",(IF(R30=\"Y\",\"\",(IF(T30=\"Y\",\"\",(IF($CY$4=\"\",\"\",(IF(AA30=\"\",\"\",(PI()*((BP30/2)*(BP30/2)))/10000*AA30)))))))))))))","v":""}]
[null,null,null,null,null,null,null,null,null,null,null,null,null,null,null,null,null,null,null,null,null,{"$f":"IF(BF31=\"\",\"\",(IF(U31=\"\",\"\",(IF(BF31=\"N\",\"\",(IF(BF31=\"Y\",U31)))))))","v":""},null,{"$f":"IF(V31=\"\",\"\",(IF(BF31=\"N\",\"\",((V31*W31)/10000))))","v":""},null,null,null,0,0,0,0,0,0,0,0,0,0,0,0,0,0,0,0,0,0,0,0,0,0,0,0,0,0,0,null,null,null,null,null,null,null,null,null,null,null,null,null,null,null,null,null,null,"",null,null,null,"","",null,"",null,"",null,"",null,"","","","",{"$f":"IF(CI31=\"\",\"\",((IF($CI31<20,4*$CI31/550,(IF($CI31<29.1,6*$CI31/550,(IF($CI31<40.1,8*$CI31/550,(IF($CI31<60.1,10*$CI31/550,12*$CI31/550))))))))*AA31))","v":""},{"$f":"IF(BF31=\"\",\"\",(IF(BF31=\"N\",\"\",(IF(T31=\"Y\",\"Y\",(IF(AA31=\"\",\"Y\",(IF(AA31=0,\"\",(IF(BF31=\"Y\",(AB31+AC31+AE31+AF31+AH31+AI31))))))))))))","v":""},{"$f":"IF(BG31=\"\",\"\",(IF(BG31=\"N\",\"\",(IF(BF31=\"Y\",\"\",(IF(Q31=\"Y\",\"\",(IF(BG31=\"Y\",(AW31+AY31+AZ31+BB31))))))))))","v":""},{"$f":"(IF(BF31=\"Y\",\"\",(IF(BG31=\"Y\",\"\",(IF(AL31>0,\"\",(IF(T31=\"Y\",\"Y\",(IF(AA31=\"\",\"\",(IF(AJ31>0,BI31,(IF(AK31>0,BI31,(AM31+AN31+AR31+AS31+AU31+AV31+AP31+AQ31)))))))))))))))","v":""},{"$f":"(IF(AA31=\"\",\"\",(IF(M31=\"\",\"\",(IF(Q31=\"Y\",\"\",(IF(BG31=\"N\",\"\",(IF(BF31=\"Y\",\"\",(IF(BG31=\"Y\",(AX31+BA31)))))))))))))","v":""},"",{"$f":"IF(AA31=\"\",\"\",(IF(Q31=\"Y\",\"\",(IF(AR31=0,\"\",(AR31))))))","v":""},{"$f":"IF(AO31=0,\"\",(IF(Q31=\"Y\",\"\",(AO31*2))))","v":""},{"$f":"IF(AM31=0,\"\",(IF(Q31=\"Y\",\"\",(AM31*2))))","v":""},"","",{"$f":"IF(BN31=\"\",\"\",(IF(S31=\"Y\",\"\",(IF(R31=\"Y\",\"\",(IF(Q31=\"Y\",\"\",(IF(T31=\"Y\",\"\",(IF(BF31=\"\",\"\",(IF(BF31=\"N\",\"\",(CL31))))))))))))))","v":""},{"$f":"IF(BF31=\"\",\"\",(IF(BF31=\"N\",\"\",(IF(BP31=\"\",\"\",(IF(R31=\"Y\",\"\",(IF(T31=\"Y\",\"\",(IF($CY$4=\"\",\"\",(IF(AA31=\"\",\"\",(PI()*((BP31/2)*(BP31/2)))/10000*AA31)))))))))))))","v":""}]
[null,null,null,"yyyyy","MAJOR PRUNING",null,null,null,null,null,null,null,null,null,null,null,null,null,null,null,null,null,null,null,null,null,null,null,null,null,null,null,null,null,null,null,null,null,null,null,null,null,null,null,null,null,null,null,null,null,null,null,null,null,null,null,null,null,null,null,null,null,null,null,null,null,null,null,null,null,null,null,null,null,null,null,null,null,null,null,null,null,null,null,null,null,null,null,null,null,"20% of Combined SEB for Major Pruning\n(NVA Scattered Tree Scores)",null,null,null,null,null,null,null,null,null,{"$f":"SUM(CW33:CW34)/100*20","v":0}]
[null,null,null,null,null,null,null,null,null,null,null,null,null,null,null,null,null,null,null,null,null,{"$f":"IF(BF33=\"\",\"\",(IF(U33=\"\",\"\",(IF(BF33=\"N\",\"\",(IF(BF33=\"Y\",U33)))))))","v":""},null,{"$f":"IF(V33=\"\",\"\",(IF(BF33=\"N\",\"\",((V33*W33)/10000))))","v":""},null,null,null,{"$f":"IF(M33=\"\",0,(IF(T33=\"\",0,(IF(T33=\"Y\",0,(IF(S33=\"Y\",0, (IF(R33=\"Y\",0,(IF(BF33=\"N\",0,(IF(M33=\"P\",AA33)))))))))))))","v":0},{"$f":"IF(N33=\"\",0,(IF(T33=\"\",0,(IF(T33=\"Y\",0,(IF(S33=\"Y\",0, (IF(R33=\"Y\",0,(IF(BF33=\"N\",0,(IF(N33=\"P\",AA33)))))))))))))","v":0},{"$f":"IF(M33=\"\",0,(IF(T33=\"\",0,(IF(T33=\"N\",0,(IF(S33=\"Y\",0,(IF(BF33=\"N\",0,(IF(T33=\"Y\",(X33))))))))))))","v":0},{"$f":"IF(M33=\"\",0,(IF(T33=\"\",0,(IF(T33=\"Y\",0,(IF(S33=\"N\",0,(IF(BF33=\"N\",0,(IF(M33=\"P\",AA33)))))))))))","v":0},{"$f":"IF(N33=\"\",0,(IF(T33=\"\",0,(IF(T33=\"Y\",0,(IF(S33=\"N\",0, (IF(BF33=\"N\",0,(IF(N33=\"P\",AA33)))))))))))","v":0},{"$f":"IF(M33=\"\",0,(IF(T33=\"\",0,(IF(S33=\"N\",0,(IF(BF33=\"N\",0,(IF(T33=\"N\",0,(IF(T33=\"Y\",U33)))))))))))","v":0},{"$f":"IF(M33=\"\",0,(IF(T33=\"\",0,(IF(T33=\"Y\",0,(IF(S33=\"Y\",0,(IF(R33=\"N\",0,(IF(BF33=\"N\",0,(IF(M33=\"P\",AA33)))))))))))))","v":0},{"$f":"IF(N33=\"\",0,(IF(T33=\"\",0,(IF(T33=\"Y\",0,(IF(R33=\"N\",0, (IF(BF33=\"N\",0,(IF(N33=\"P\",AA33)))))))))))","v":0},{"$f":"IF(M33=\"\",0,(IF(BC33=\"N\",0,(IF(BD33=\"Y\",0,(IF(T33=\"Y\",0,(IF(BC33=\"E\",AA33,(IF(BC33=\"D\",AA33,(IF(BC33=\"O\",AA33,(IF(BC33=\"M\",AA33)))))))))))))))","v":0},{"$f":"IF(N33=\"\",0,(IF(BH33>0,0,(IF(BC33=\"N\",0,(IF(BD33=\"Y\",0,(IF(T33=\"Y\",0,(IF(BC33=\"E\",AA33,(IF(BC33=\"D\",AA33,(IF(BC33=\"O\",AA33,(IF(BC33=\"M\",AA33)))))))))))))))))","v":0},{"$f":"IF(M33=\"\",0,(IF(U33=\"\",0,(IF(BC33=\"N\",0,(IF(BD33=\"Y\",0,IF(T33=\"N\",0,(IF(BC33=\"E\",U33,(IF(BC33=\"D\",U33,(IF(BC33=\"O\",U33,(IF(BC33=\"M\",U33))))))))))))))))","v":0},{"$f":"(IF(M33=\"\",0,(IF(BE33=\"N\",0,(IF(BF33=\"Y\",0,(IF(Q33=\"Y\",0,(IF(R33=\"Y\",0,(IF(T33=\"Y\",0,(IF(BE33=\"Y\",AA33))))))))))))))","v":0},{"$f":"IF(N33=\"\",0,(IF(AA33=\"\",0,(IF(BE33=\"N\",0,(IF(BF33=\"Y\",0,(IF(BH33>0,0,(IF(R33=\"Y\",0,(IF(T33=\"Y\",0,(IF(BE33=\"Y\",AA33)))))))))))))))","v":0},{"$f":"IF(M33=\"\",0,(IF(U33=\"\",0,(IF(T33=\"N\",0,(IF(BE33=\"N\",0,(IF(BF33=\"Y\",0,(IF(BE33=\"Y\",U33)))))))))))","v":0},{"$f":"(IF(M33=\"\",0,(IF(T33=\"Y\",0,(IF(S33=\"Y\",0,(IF(BD33=\"Y\",0,(IF(BF33=\"Y\",0,(IF(R33=\"N\",0,(IF(M33=\"P\",AA33))))))))))))))+(IF(M33=\"\",0,(IF(R33=\"Y\",0,(IF(T33=\"Y\",0,(IF(S33=\"Y\",0,(IF(BD33=\"Y\",0,(IF(BF33=\"Y\",0,(IF(Q33=\"Y\",AA33))))))))))))))","v":0},{"$f":"IF(N33=\"\",0,(IF(T33=\"\",0,(IF(T33=\"Y\",0,(IF(R33=\"N\",0, (IF(BF33=\"Y\",0,(IF(BE33=\"N\",0,(IF(N33=\"P\",AA33)))))))))))))","v":0},{"$f":"(IF(M33=\"\",0,(IF(T33=\"Y\",0,(IF(BG33=\"Y\",0,(IF(BD33=\"N\",0,(IF(Q33=\"Y\",0,(IF(R33=\"Y\",0,(IF(BD33=\"Y\",AA33))))))))))))))","v":0},{"$f":"IF(N33=\"\",0,(IF(BD33=\"\",0,(IF(BD33=\"N\",0,(IF(BH33>0,0,(IF(T33=\"Y\",0,(IF(R33=\"Y\",0,(IF(BD33=\"Y\",AA33)))))))))))))","v":0},{"$f":"IF(M33=\"\",0,(IF(BD33=\"\",0,(IF(BD33=\"N\",0,(IF(T33=\"N\",0,(IF(Q33=\"Y\",0,(IF(BD33=\"Y\",U33)))))))))))","v":0},{"$f":"(IF(M33=\"\",0,(IF(T33=\"\",0,(IF(T33=\"Y\",0,(IF(S33=\"Y\",0,(IF(R33=\"N\",0,(IF(BE33=\"Y\",0,(IF(M33=\"P\",AA33))))))))))))))+(IF(R33=\"Y\",0,(IF(M33=\"\",0,(IF(T33=\"\",0,(IF(T33=\"Y\",0,(IF(S33=\"Y\",0,(IF(BE33=\"Y\",0,(IF(Q33=\"Y\",AA33))))))))))))))","v":0},{"$f":"IF(N33=\"\",0,(IF(T33=\"\",0,(IF(T33=\"Y\",0,(IF(R33=\"N\",0, (IF(BE33=\"Y\",0,(IF(BD33=\"N\",0,(IF(N33=\"P\",AA33)))))))))))))","v":0},{"$f":"IF(M33=\"\",0,(IF(BF33=\"Y\",0,(IF(BH33=\"\",0,(IF(BG33=\"N\",0,(IF(BH33=\"R\",0,(IF(BH33=\"S\",AA33)))))))))))","v":0},{"$f":"(IF(AW33=0,0,AW33))*3","v":0},{"$f":"IF(N33=\"\",0,(IF(BF33=\"Y\",0,(IF(BG33=\"N\",0,(IF(BH33=\"R\",0,(IF(BH33=\"S\",AA33)))))))))","v":0},{"$f":"IF(M33=\"\",0,(IF(BF33=\"Y\",0,(IF(BG33=\"N\",0,(IF(BH33=\"\",0,(IF(BH33=\"S\",0,(IF(BH33=\"R\",AA33)))))))))))","v":0},{"$f":"(IF(AZ33=0,0,AZ33))*2","v":0},{"$f":"IF(N33=\"\",0,(IF(BF33=\"Y\",0,(IF(BG33=\"N\",0,(IF(BH33=\"S\",0,(IF(BH33=\"R\",AA33)))))))))","v":0},null,null,null,null,null,null,null,null,null,null,null,null,null,null,null,null,null,null,{"$f":"(IF(BT33=\"\",\"\",((BT33*50)^0.42)*0.64))","v":""},null,null,null,{"$f":"IF(BF33=\"\",\"\",(IF(BF33=\"N\",\"\",(IF(BF33=\"Y\",(IF(BN33=\"\",\"\",(IF($BN33<10,1,(IF($BN33<20,2,3))))*1.05)))))))","v":""},{"$f":"IF(BV33=\"\",\"\",(IF(BF33=\"N\",\"\",(IF(BF33=\"Y\",((100-$BV33)*0.04)+2)))))","v":""},null,{"$f":"IF(CA33=\"\",\"\",(IF(BF33=\"N\",\"\",(IF(BF33=\"Y\",(CA33*1.45))))))","v":""},null,{"$f":"IF(CC33=\"\",\"\",(IF(BF33=\"N\",\"\",(IF(BF33=\"Y\",(CC33*0.65))))))","v":""},null,{"$f":"IF(CE33=\"\",\"\",(IF(BF33=\"N\",\"\",(IF(BF33=\"Y\",(CE33*0.4))))))","v":""},null,{"$f":"IF(CG33=\"\",\"\",(IF(BF33=\"N\",\"\",(IF(BF33=\"Y\",(CG33*0.35))))))","v":""},{"$f":"IF(BY33=\"\",\"\",(SUM(BY33,BZ33,CB33,CD33,CF33,CH33)*SUM(BY33,BZ33,CB33,CD33,CF33,CH33)*SUM(BY33,BZ33,CB33,CD33,CF33,CH33)/55.5))","v":""},{"$f":"IF(CI33=\"\",\"\",IF(CI33<30,0,(IF(CI33>=30,1))))","v":""},{"$f":"IF(CI33=\"\",\"\",(IF(CJ33=1,CJ33=\"@\",(IF(CJ33=0,(IF($CI33<20,4*$CI33/550,(IF($CI33<30,6*$CI33/550,(IF($CI33<41,8*$CI33/550,(IF($CI33<61,10*$CI33/550,12*$CI33/550)))))))))))))","v":""},{"$f":"IF(CI33=\"\",\"\",((IF($CI33<20,4*$CI33/550,(IF($CI33<29.1,6*$CI33/550,(IF($CI33<40.1,8*$CI33/550,(IF($CI33<60.1,10*$CI33/550,12*$CI33/550))))))))*AA33))","v":""},{"$f":"IF(BF33=\"\",\"\",(IF(BF33=\"N\",\"\",(IF(T33=\"Y\",\"Y\",(IF(AA33=\"\",\"Y\",(IF(AA33=0,\"\",(IF(BF33=\"Y\",(AB33+AC33+AE33+AF33+AH33+AI33))))))))))))","v":""},{"$f":"IF(BG33=\"\",\"\",(IF(BG33=\"N\",\"\",(IF(BF33=\"Y\",\"\",(IF(Q33=\"Y\",\"\",(IF(BG33=\"Y\",(AW33+AY33+AZ33+BB33))))))))))","v":""},{"$f":"(IF(BF33=\"Y\",\"\",(IF(BG33=\"Y\",\"\",(IF(AL33>0,\"\",(IF(T33=\"Y\",\"Y\",(IF(AA33=\"\",\"\",(IF(AJ33>0,BI33,(IF(AK33>0,BI33,(AM33+AN33+AR33+AS33+AU33+AV33+AP33+AQ33)))))))))))))))","v":""},{"$f":"(IF(AA33=\"\",\"\",(IF(M33=\"\",\"\",(IF(Q33=\"Y\",\"\",(IF(BG33=\"N\",\"\",(IF(BF33=\"Y\",\"\",(IF(BG33=\"Y\",(AX33+BA33)))))))))))))","v":""},{"$f":"IF(AT33=0,\"\",(IF(AQ33=\"Y\",\"\",(AT33))))","v":""},{"$f":"IF(AA33=\"\",\"\",(IF(Q33=\"Y\",\"\",(IF(AR33=0,\"\",(AR33))))))","v":""},{"$f":"IF(AO33=0,\"\",(IF(Q33=\"Y\",\"\",(AO33*2))))","v":""},{"$f":"IF(AM33=0,\"\",(IF(Q33=\"Y\",\"\",(AM33*2))))","v":""},{"$f":"(IF(AE33=0,\"\",(IF(Q33=\"Y\",\"\",(AE33*2)))))","v":""},{"$f":"IF(AD33=0,\"\",(IF(Q33=\"Y\",\"\",(AD33))))","v":""},{"$f":"IF(BN33=\"\",\"\",(IF(S33=\"Y\",\"\",(IF(R33=\"Y\",\"\",(IF(Q33=\"Y\",\"\",(IF(T33=\"Y\",\"\",(IF(BF33=\"\",\"\",(IF(BF33=\"N\",\"\",(CL33))))))))))))))","v":""},{"$f":"IF(BF33=\"\",\"\",(IF(BF33=\"N\",\"\",(IF(BP33=\"\",\"\",(IF(R33=\"Y\",\"\",(IF(T33=\"Y\",\"\",(IF($CY$4=\"\",\"\",(IF(AA33=\"\",\"\",(PI()*((BP33/2)*(BP33/2)))/10000*AA33)))))))))))))","v":""}]
[null,null,null,null,null,null,null,null,null,null,null,null,null,null,null,null,null,null,null,null,null,{"$f":"IF(BF34=\"\",\"\",(IF(U34=\"\",\"\",(IF(BF34=\"N\",\"\",(IF(BF34=\"Y\",U34)))))))","v":""},null,{"$f":"IF(V34=\"\",\"\",(IF(BF34=\"N\",\"\",((V34*W34)/10000))))","v":""},null,null,null,0,0,0,0,0,0,0,0,0,0,0,0,0,0,0,0,0,0,0,0,0,0,0,0,0,0,0,null,null,null,null,null,null,null,null,null,null,null,null,null,null,null,null,null,null,"",null,null,null,"","",null,"",null,"",null,"",null,"","","","",{"$f":"IF(CI34=\"\",\"\",((IF($CI34<20,4*$CI34/550,(IF($CI34<29.1,6*$CI34/550,(IF($CI34<40.1,8*$CI34/550,(IF($CI34<60.1,10*$CI34/550,12*$CI34/550))))))))*AA34))","v":""},{"$f":"IF(BF34=\"\",\"\",(IF(BF34=\"N\",\"\",(IF(T34=\"Y\",\"Y\",(IF(AA34=\"\",\"Y\",(IF(AA34=0,\"\",(IF(BF34=\"Y\",(AB34+AC34+AE34+AF34+AH34+AI34))))))))))))","v":""},{"$f":"IF(BG34=\"\",\"\",(IF(BG34=\"N\",\"\",(IF(BF34=\"Y\",\"\",(IF(Q34=\"Y\",\"\",(IF(BG34=\"Y\",(AW34+AY34+AZ34+BB34))))))))))","v":""},{"$f":"(IF(BF34=\"Y\",\"\",(IF(BG34=\"Y\",\"\",(IF(AL34>0,\"\",(IF(T34=\"Y\",\"Y\",(IF(AA34=\"\",\"\",(IF(AJ34>0,BI34,(IF(AK34>0,BI34,(AM34+AN34+AR34+AS34+AU34+AV34+AP34+AQ34)))))))))))))))","v":""},{"$f":"(IF(AA34=\"\",\"\",(IF(M34=\"\",\"\",(IF(Q34=\"Y\",\"\",(IF(BG34=\"N\",\"\",(IF(BF34=\"Y\",\"\",(IF(BG34=\"Y\",(AX34+BA34)))))))))))))","v":""},"",{"$f":"IF(AA34=\"\",\"\",(IF(Q34=\"Y\",\"\",(IF(AR34=0,\"\",(AR34))))))","v":""},{"$f":"IF(AO34=0,\"\",(IF(Q34=\"Y\",\"\",(AO34*2))))","v":""},{"$f":"IF(AM34=0,\"\",(IF(Q34=\"Y\",\"\",(AM34*2))))","v":""},"","",{"$f":"IF(BN34=\"\",\"\",(IF(S34=\"Y\",\"\",(IF(R34=\"Y\",\"\",(IF(Q34=\"Y\",\"\",(IF(T34=\"Y\",\"\",(IF(BF34=\"\",\"\",(IF(BF34=\"N\",\"\",(CL34))))))))))))))","v":""},{"$f":"IF(BF34=\"\",\"\",(IF(BF34=\"N\",\"\",(IF(BP34=\"\",\"\",(IF(R34=\"Y\",\"\",(IF(T34=\"Y\",\"\",(IF($CY$4=\"\",\"\",(IF(AA34=\"\",\"\",(PI()*((BP34/2)*(BP34/2)))/10000*AA34)))))))))))))","v":""}]
[null,null,null,"qqqqq","MINOR PRUNING\nNo SEB/Approvals requirement for Minor Pruning"]
[null,null,null,null,null,null,null,null,null,null,null,null,null,null,null,null,null,null,null,null,null,{"$f":"IF(BF36=\"\",\"\",(IF(U36=\"\",\"\",(IF(BF36=\"N\",\"\",(IF(BF36=\"Y\",U36)))))))","v":""},null,{"$f":"IF(V36=\"\",\"\",(IF(BF36=\"N\",\"\",((V36*W36)/10000))))","v":""},null,null,null,{"$f":"IF(M36=\"\",0,(IF(T36=\"\",0,(IF(T36=\"Y\",0,(IF(S36=\"Y\",0, (IF(R36=\"Y\",0,(IF(BF36=\"N\",0,(IF(M36=\"P\",AA36)))))))))))))","v":0},{"$f":"IF(N36=\"\",0,(IF(T36=\"\",0,(IF(T36=\"Y\",0,(IF(S36=\"Y\",0, (IF(R36=\"Y\",0,(IF(BF36=\"N\",0,(IF(N36=\"P\",AA36)))))))))))))","v":0},{"$f":"IF(M36=\"\",0,(IF(T36=\"\",0,(IF(T36=\"N\",0,(IF(S36=\"Y\",0,(IF(BF36=\"N\",0,(IF(T36=\"Y\",(X36))))))))))))","v":0},{"$f":"IF(M36=\"\",0,(IF(T36=\"\",0,(IF(T36=\"Y\",0,(IF(S36=\"N\",0,(IF(BF36=\"N\",0,(IF(M36=\"P\",AA36)))))))))))","v":0},{"$f":"IF(N36=\"\",0,(IF(T36=\"\",0,(IF(T36=\"Y\",0,(IF(S36=\"N\",0, (IF(BF36=\"N\",0,(IF(N36=\"P\",AA36)))))))))))","v":0},{"$f":"IF(M36=\"\",0,(IF(T36=\"\",0,(IF(S36=\"N\",0,(IF(BF36=\"N\",0,(IF(T36=\"N\",0,(IF(T36=\"Y\",U36)))))))))))","v":0},{"$f":"IF(M36=\"\",0,(IF(T36=\"\",0,(IF(T36=\"Y\",0,(IF(S36=\"Y\",0,(IF(R36=\"N\",0,(IF(BF36=\"N\",0,(IF(M36=\"P\",AA36)))))))))))))","v":0},{"$f":"IF(N36=\"\",0,(IF(T36=\"\",0,(IF(T36=\"Y\",0,(IF(R36=\"N\",0, (IF(BF36=\"N\",0,(IF(N36=\"P\",AA36)))))))))))","v":0},{"$f":"IF(M36=\"\",0,(IF(BC36=\"N\",0,(IF(BD36=\"Y\",0,(IF(T36=\"Y\",0,(IF(BC36=\"E\",AA36,(IF(BC36=\"D\",AA36,(IF(BC36=\"O\",AA36,(IF(BC36=\"M\",AA36)))))))))))))))","v":0},{"$f":"IF(N36=\"\",0,(IF(BH36>0,0,(IF(BC36=\"N\",0,(IF(BD36=\"Y\",0,(IF(T36=\"Y\",0,(IF(BC36=\"E\",AA36,(IF(BC36=\"D\",AA36,(IF(BC36=\"O\",AA36,(IF(BC36=\"M\",AA36)))))))))))))))))","v":0},{"$f":"IF(M36=\"\",0,(IF(U36=\"\",0,(IF(BC36=\"N\",0,(IF(BD36=\"Y\",0,IF(T36=\"N\",0,(IF(BC36=\"E\",U36,(IF(BC36=\"D\",U36,(IF(BC36=\"O\",U36,(IF(BC36=\"M\",U36))))))))))))))))","v":0},{"$f":"(IF(M36=\"\",0,(IF(BE36=\"N\",0,(IF(BF36=\"Y\",0,(IF(Q36=\"Y\",0,(IF(R36=\"Y\",0,(IF(T36=\"Y\",0,(IF(BE36=\"Y\",AA36))))))))))))))","v":0},{"$f":"IF(N36=\"\",0,(IF(AA36=\"\",0,(IF(BE36=\"N\",0,(IF(BF36=\"Y\",0,(IF(BH36>0,0,(IF(R36=\"Y\",0,(IF(T36=\"Y\",0,(IF(BE36=\"Y\",AA36)))))))))))))))","v":0},{"$f":"IF(M36=\"\",0,(IF(U36=\"\",0,(IF(T36=\"N\",0,(IF(BE36=\"N\",0,(IF(BF36=\"Y\",0,(IF(BE36=\"Y\",U36)))))))))))","v":0},{"$f":"(IF(M36=\"\",0,(IF(T36=\"Y\",0,(IF(S36=\"Y\",0,(IF(BD36=\"Y\",0,(IF(BF36=\"Y\",0,(IF(R36=\"N\",0,(IF(M36=\"P\",AA36))))))))))))))+(IF(M36=\"\",0,(IF(R36=\"Y\",0,(IF(T36=\"Y\",0,(IF(S36=\"Y\",0,(IF(BD36=\"Y\",0,(IF(BF36=\"Y\",0,(IF(Q36=\"Y\",AA36))))))))))))))","v":0},{"$f":"IF(N36=\"\",0,(IF(T36=\"\",0,(IF(T36=\"Y\",0,(IF(R36=\"N\",0, (IF(BF36=\"Y\",0,(IF(BE36=\"N\",0,(IF(N36=\"P\",AA36)))))))))))))","v":0},{"$f":"(IF(M36=\"\",0,(IF(T36=\"Y\",0,(IF(BG36=\"Y\",0,(IF(BD36=\"N\",0,(IF(Q36=\"Y\",0,(IF(R36=\"Y\",0,(IF(BD36=\"Y\",AA36))))))))))))))","v":0},{"$f":"IF(N36=\"\",0,(IF(BD36=\"\",0,(IF(BD36=\"N\",0,(IF(BH36>0,0,(IF(T36=\"Y\",0,(IF(R36=\"Y\",0,(IF(BD36=\"Y\",AA36)))))))))))))","v":0},{"$f":"IF(M36=\"\",0,(IF(BD36=\"\",0,(IF(BD36=\"N\",0,(IF(T36=\"N\",0,(IF(Q36=\"Y\",0,(IF(BD36=\"Y\",U36)))))))))))","v":0},{"$f":"(IF(M36=\"\",0,(IF(T36=\"\",0,(IF(T36=\"Y\",0,(IF(S36=\"Y\",0,(IF(R36=\"N\",0,(IF(BE36=\"Y\",0,(IF(M36=\"P\",AA36))))))))))))))+(IF(R36=\"Y\",0,(IF(M36=\"\",0,(IF(T36=\"\",0,(IF(T36=\"Y\",0,(IF(S36=\"Y\",0,(IF(BE36=\"Y\",0,(IF(Q36=\"Y\",AA36))))))))))))))","v":0},{"$f":"IF(N36=\"\",0,(IF(T36=\"\",0,(IF(T36=\"Y\",0,(IF(R36=\"N\",0, (IF(BE36=\"Y\",0,(IF(BD36=\"N\",0,(IF(N36=\"P\",AA36)))))))))))))","v":0},{"$f":"IF(M36=\"\",0,(IF(BF36=\"Y\",0,(IF(BH36=\"\",0,(IF(BG36=\"N\",0,(IF(BH36=\"R\",0,(IF(BH36=\"S\",AA36)))))))))))","v":0},{"$f":"(IF(AW36=0,0,AW36))*3","v":0},{"$f":"IF(N36=\"\",0,(IF(BF36=\"Y\",0,(IF(BG36=\"N\",0,(IF(BH36=\"R\",0,(IF(BH36=\"S\",AA36)))))))))","v":0},{"$f":"IF(M36=\"\",0,(IF(BF36=\"Y\",0,(IF(BG36=\"N\",0,(IF(BH36=\"\",0,(IF(BH36=\"S\",0,(IF(BH36=\"R\",AA36)))))))))))","v":0},{"$f":"(IF(AZ36=0,0,AZ36))*2","v":0},{"$f":"IF(N36=\"\",0,(IF(BF36=\"Y\",0,(IF(BG36=\"N\",0,(IF(BH36=\"S\",0,(IF(BH36=\"R\",AA36)))))))))","v":0},null,null,null,null,null,null,null,null,null,null,null,null,null,null,null,null,null,null,{"$f":"(IF(BT36=\"\",\"\",((BT36*50)^0.42)*0.64))","v":""},null,null,null,{"$f":"IF(BF36=\"\",\"\",(IF(BF36=\"N\",\"\",(IF(BF36=\"Y\",(IF(BN36=\"\",\"\",(IF($BN36<10,1,(IF($BN36<20,2,3))))*1.05)))))))","v":""},{"$f":"IF(BV36=\"\",\"\",(IF(BF36=\"N\",\"\",(IF(BF36=\"Y\",((100-$BV36)*0.04)+2)))))","v":""},null,{"$f":"IF(CA36=\"\",\"\",(IF(BF36=\"N\",\"\",(IF(BF36=\"Y\",(CA36*1.45))))))","v":""},null,{"$f":"IF(CC36=\"\",\"\",(IF(BF36=\"N\",\"\",(IF(BF36=\"Y\",(CC36*0.65))))))","v":""},null,{"$f":"IF(CE36=\"\",\"\",(IF(BF36=\"N\",\"\",(IF(BF36=\"Y\",(CE36*0.4))))))","v":""},null,{"$f":"IF(CG36=\"\",\"\",(IF(BF36=\"N\",\"\",(IF(BF36=\"Y\",(CG36*0.35))))))","v":""},{"$f":"IF(BY36=\"\",\"\",(SUM(BY36,BZ36,CB36,CD36,CF36,CH36)*SUM(BY36,BZ36,CB36,CD36,CF36,CH36)*SUM(BY36,BZ36,CB36,CD36,CF36,CH36)/55.5))","v":""},{"$f":"IF(CI36=\"\",\"\",IF(CI36<30,0,(IF(CI36>=30,1))))","v":""},{"$f":"IF(CI36=\"\",\"\",(IF(CJ36=1,CJ36=\"@\",(IF(CJ36=0,(IF($CI36<20,4*$CI36/550,(IF($CI36<30,6*$CI36/550,(IF($CI36<41,8*$CI36/550,(IF($CI36<61,10*$CI36/550,12*$CI36/550)))))))))))))","v":""},{"$f":"IF(CI36=\"\",\"\",((IF($CI36<20,4*$CI36/550,(IF($CI36<29.1,6*$CI36/550,(IF($CI36<40.1,8*$CI36/550,(IF($CI36<60.1,10*$CI36/550,12*$CI36/550))))))))*AA36))","v":""},{"$f":"IF(BF36=\"\",\"\",(IF(BF36=\"N\",\"\",(IF(T36=\"Y\",\"Y\",(IF(AA36=\"\",\"Y\",(IF(AA36=0,\"\",(IF(BF36=\"Y\",(AB36+AC36+AE36+AF36+AH36+AI36))))))))))))","v":""},{"$f":"IF(BG36=\"\",\"\",(IF(BG36=\"N\",\"\",(IF(BF36=\"Y\",\"\",(IF(Q36=\"Y\",\"\",(IF(BG36=\"Y\",(AW36+AY36+AZ36+BB36))))))))))","v":""},{"$f":"(IF(BF36=\"Y\",\"\",(IF(BG36=\"Y\",\"\",(IF(AL36>0,\"\",(IF(T36=\"Y\",\"Y\",(IF(AA36=\"\",\"\",(IF(AJ36>0,BI36,(IF(AK36>0,BI36,(AM36+AN36+AR36+AS36+AU36+AV36+AP36+AQ36)))))))))))))))","v":""},{"$f":"(IF(AA36=\"\",\"\",(IF(M36=\"\",\"\",(IF(Q36=\"Y\",\"\",(IF(BG36=\"N\",\"\",(IF(BF36=\"Y\",\"\",(IF(BG36=\"Y\",(AX36+BA36)))))))))))))","v":""},{"$f":"IF(AT36=0,\"\",(IF(AQ36=\"Y\",\"\",(AT36))))","v":""},{"$f":"IF(AA36=\"\",\"\",(IF(Q36=\"Y\",\"\",(IF(AR36=0,\"\",(AR36))))))","v":""},{"$f":"IF(AO36=0,\"\",(IF(Q36=\"Y\",\"\",(AO36*2))))","v":""},{"$f":"IF(AM36=0,\"\",(IF(Q36=\"Y\",\"\",(AM36*2))))","v":""},{"$f":"(IF(AE36=0,\"\",(IF(Q36=\"Y\",\"\",(AE36*2)))))","v":""},{"$f":"IF(AD36=0,\"\",(IF(Q36=\"Y\",\"\",(AD36))))","v":""},{"$f":"IF(BN36=\"\",\"\",(IF(S36=\"Y\",\"\",(IF(R36=\"Y\",\"\",(IF(Q36=\"Y\",\"\",(IF(T36=\"Y\",\"\",(IF(BF36=\"\",\"\",(IF(BF36=\"N\",\"\",(CL36))))))))))))))","v":""},{"$f":"IF(BF36=\"\",\"\",(IF(BF36=\"N\",\"\",(IF(BP36=\"\",\"\",(IF(R36=\"Y\",\"\",(IF(T36=\"Y\",\"\",(IF($CY$4=\"\",\"\",(IF(AA36=\"\",\"\",(PI()*((BP36/2)*(BP36/2)))/10000*AA36)))))))))))))","v":""}]
[null,null,null,null,null,null,null,null,null,null,null,null,null,null,null,null,null,null,null,null,null,{"$f":"IF(BF37=\"\",\"\",(IF(U37=\"\",\"\",(IF(BF37=\"N\",\"\",(IF(BF37=\"Y\",U37)))))))","v":""},null,{"$f":"IF(V37=\"\",\"\",(IF(BF37=\"N\",\"\",((V37*W37)/10000))))","v":""},null,null,null,0,0,0,0,0,0,0,0,0,0,0,0,0,0,0,0,0,0,0,0,0,0,0,0,0,0,0,null,null,null,null,null,null,null,null,null,null,null,null,null,null,null,null,null,null,"",null,null,null,"","",null,"",null,"",null,"",null,"","","","",{"$f":"IF(CI37=\"\",\"\",((IF($CI37<20,4*$CI37/550,(IF($CI37<29.1,6*$CI37/550,(IF($CI37<40.1,8*$CI37/550,(IF($CI37<60.1,10*$CI37/550,12*$CI37/550))))))))*AA37))","v":""},{"$f":"IF(BF37=\"\",\"\",(IF(BF37=\"N\",\"\",(IF(T37=\"Y\",\"Y\",(IF(AA37=\"\",\"Y\",(IF(AA37=0,\"\",(IF(BF37=\"Y\",(AB37+AC37+AE37+AF37+AH37+AI37))))))))))))","v":""},{"$f":"IF(BG37=\"\",\"\",(IF(BG37=\"N\",\"\",(IF(BF37=\"Y\",\"\",(IF(Q37=\"Y\",\"\",(IF(BG37=\"Y\",(AW37+AY37+AZ37+BB37))))))))))","v":""},{"$f":"(IF(BF37=\"Y\",\"\",(IF(BG37=\"Y\",\"\",(IF(AL37>0,\"\",(IF(T37=\"Y\",\"Y\",(IF(AA37=\"\",\"\",(IF(AJ37>0,BI37,(IF(AK37>0,BI37,(AM37+AN37+AR37+AS37+AU37+AV37+AP37+AQ37)))))))))))))))","v":""},{"$f":"(IF(AA37=\"\",\"\",(IF(M37=\"\",\"\",(IF(Q37=\"Y\",\"\",(IF(BG37=\"N\",\"\",(IF(BF37=\"Y\",\"\",(IF(BG37=\"Y\",(AX37+BA37)))))))))))))","v":""},"",{"$f":"IF(AA37=\"\",\"\",(IF(Q37=\"Y\",\"\",(IF(AR37=0,\"\",(AR37))))))","v":""},{"$f":"IF(AO37=0,\"\",(IF(Q37=\"Y\",\"\",(AO37*2))))","v":""},{"$f":"IF(AM37=0,\"\",(IF(Q37=\"Y\",\"\",(AM37*2))))","v":""},"","",{"$f":"IF(BN37=\"\",\"\",(IF(S37=\"Y\",\"\",(IF(R37=\"Y\",\"\",(IF(Q37=\"Y\",\"\",(IF(T37=\"Y\",\"\",(IF(BF37=\"\",\"\",(IF(BF37=\"N\",\"\",(CL37))))))))))))))","v":""},{"$f":"IF(BF37=\"\",\"\",(IF(BF37=\"N\",\"\",(IF(BP37=\"\",\"\",(IF(R37=\"Y\",\"\",(IF(T37=\"Y\",\"\",(IF($CY$4=\"\",\"\",(IF(AA37=\"\",\"\",(PI()*((BP37/2)*(BP37/2)))/10000*AA37)))))))))))))","v":""}]
[null,null,null,"zzzzz","MONITOR\nTo be added to the Monitoring Program"]
[null,null,null,null,null,null,null,null,null,null,null,null,null,null,null,null,null,null,null,null,null,{"$f":"IF(BF39=\"\",\"\",(IF(U39=\"\",\"\",(IF(BF39=\"N\",\"\",(IF(BF39=\"Y\",U39)))))))","v":""},null,{"$f":"IF(V39=\"\",\"\",(IF(BF39=\"N\",\"\",((V39*W39)/10000))))","v":""},null,null,null,{"$f":"IF(M39=\"\",0,(IF(T39=\"\",0,(IF(T39=\"Y\",0,(IF(S39=\"Y\",0, (IF(R39=\"Y\",0,(IF(BF39=\"N\",0,(IF(M39=\"P\",AA39)))))))))))))","v":0},{"$f":"IF(N39=\"\",0,(IF(T39=\"\",0,(IF(T39=\"Y\",0,(IF(S39=\"Y\",0, (IF(R39=\"Y\",0,(IF(BF39=\"N\",0,(IF(N39=\"P\",AA39)))))))))))))","v":0},{"$f":"IF(M39=\"\",0,(IF(T39=\"\",0,(IF(T39=\"N\",0,(IF(S39=\"Y\",0,(IF(BF39=\"N\",0,(IF(T39=\"Y\",(X39))))))))))))","v":0},{"$f":"IF(M39=\"\",0,(IF(T39=\"\",0,(IF(T39=\"Y\",0,(IF(S39=\"N\",0,(IF(BF39=\"N\",0,(IF(M39=\"P\",AA39)))))))))))","v":0},{"$f":"IF(N39=\"\",0,(IF(T39=\"\",0,(IF(T39=\"Y\",0,(IF(S39=\"N\",0, (IF(BF39=\"N\",0,(IF(N39=\"P\",AA39)))))))))))","v":0},{"$f":"IF(M39=\"\",0,(IF(T39=\"\",0,(IF(S39=\"N\",0,(IF(BF39=\"N\",0,(IF(T39=\"N\",0,(IF(T39=\"Y\",U39)))))))))))","v":0},{"$f":"IF(M39=\"\",0,(IF(T39=\"\",0,(IF(T39=\"Y\",0,(IF(S39=\"Y\",0,(IF(R39=\"N\",0,(IF(BF39=\"N\",0,(IF(M39=\"P\",AA39)))))))))))))","v":0},{"$f":"IF(N39=\"\",0,(IF(T39=\"\",0,(IF(T39=\"Y\",0,(IF(R39=\"N\",0, (IF(BF39=\"N\",0,(IF(N39=\"P\",AA39)))))))))))","v":0},{"$f":"IF(M39=\"\",0,(IF(BC39=\"N\",0,(IF(BD39=\"Y\",0,(IF(T39=\"Y\",0,(IF(BC39=\"E\",AA39,(IF(BC39=\"D\",AA39,(IF(BC39=\"O\",AA39,(IF(BC39=\"M\",AA39)))))))))))))))","v":0},{"$f":"IF(N39=\"\",0,(IF(BH39>0,0,(IF(BC39=\"N\",0,(IF(BD39=\"Y\",0,(IF(T39=\"Y\",0,(IF(BC39=\"E\",AA39,(IF(BC39=\"D\",AA39,(IF(BC39=\"O\",AA39,(IF(BC39=\"M\",AA39)))))))))))))))))","v":0},{"$f":"IF(M39=\"\",0,(IF(U39=\"\",0,(IF(BC39=\"N\",0,(IF(BD39=\"Y\",0,IF(T39=\"N\",0,(IF(BC39=\"E\",U39,(IF(BC39=\"D\",U39,(IF(BC39=\"O\",U39,(IF(BC39=\"M\",U39))))))))))))))))","v":0},{"$f":"(IF(M39=\"\",0,(IF(BE39=\"N\",0,(IF(BF39=\"Y\",0,(IF(Q39=\"Y\",0,(IF(R39=\"Y\",0,(IF(T39=\"Y\",0,(IF(BE39=\"Y\",AA39))))))))))))))","v":0},{"$f":"IF(N39=\"\",0,(IF(AA39=\"\",0,(IF(BE39=\"N\",0,(IF(BF39=\"Y\",0,(IF(BH39>0,0,(IF(R39=\"Y\",0,(IF(T39=\"Y\",0,(IF(BE39=\"Y\",AA39)))))))))))))))","v":0},{"$f":"IF(M39=\"\",0,(IF(U39=\"\",0,(IF(T39=\"N\",0,(IF(BE39=\"N\",0,(IF(BF39=\"Y\",0,(IF(BE39=\"Y\",U39)))))))))))","v":0},{"$f":"(IF(M39=\"\",0,(IF(T39=\"Y\",0,(IF(S39=\"Y\",0,(IF(BD39=\"Y\",0,(IF(BF39=\"Y\",0,(IF(R39=\"N\",0,(IF(M39=\"P\",AA39))))))))))))))+(IF(M39=\"\",0,(IF(R39=\"Y\",0,(IF(T39=\"Y\",0,(IF(S39=\"Y\",0,(IF(BD39=\"Y\",0,(IF(BF39=\"Y\",0,(IF(Q39=\"Y\",AA39))))))))))))))","v":0},{"$f":"IF(N39=\"\",0,(IF(T39=\"\",0,(IF(T39=\"Y\",0,(IF(R39=\"N\",0, (IF(BF39=\"Y\",0,(IF(BE39=\"N\",0,(IF(N39=\"P\",AA39)))))))))))))","v":0},{"$f":"(IF(M39=\"\",0,(IF(T39=\"Y\",0,(IF(BG39=\"Y\",0,(IF(BD39=\"N\",0,(IF(Q39=\"Y\",0,(IF(R39=\"Y\",0,(IF(BD39=\"Y\",AA39))))))))))))))","v":0},{"$f":"IF(N39=\"\",0,(IF(BD39=\"\",0,(IF(BD39=\"N\",0,(IF(BH39>0,0,(IF(T39=\"Y\",0,(IF(R39=\"Y\",0,(IF(BD39=\"Y\",AA39)))))))))))))","v":0},{"$f":"IF(M39=\"\",0,(IF(BD39=\"\",0,(IF(BD39=\"N\",0,(IF(T39=\"N\",0,(IF(Q39=\"Y\",0,(IF(BD39=\"Y\",U39)))))))))))","v":0},{"$f":"(IF(M39=\"\",0,(IF(T39=\"\",0,(IF(T39=\"Y\",0,(IF(S39=\"Y\",0,(IF(R39=\"N\",0,(IF(BE39=\"Y\",0,(IF(M39=\"P\",AA39))))))))))))))+(IF(R39=\"Y\",0,(IF(M39=\"\",0,(IF(T39=\"\",0,(IF(T39=\"Y\",0,(IF(S39=\"Y\",0,(IF(BE39=\"Y\",0,(IF(Q39=\"Y\",AA39))))))))))))))","v":0},{"$f":"IF(N39=\"\",0,(IF(T39=\"\",0,(IF(T39=\"Y\",0,(IF(R39=\"N\",0, (IF(BE39=\"Y\",0,(IF(BD39=\"N\",0,(IF(N39=\"P\",AA39)))))))))))))","v":0},{"$f":"IF(M39=\"\",0,(IF(BF39=\"Y\",0,(IF(BH39=\"\",0,(IF(BG39=\"N\",0,(IF(BH39=\"R\",0,(IF(BH39=\"S\",AA39)))))))))))","v":0},{"$f":"(IF(AW39=0,0,AW39))*3","v":0},{"$f":"IF(N39=\"\",0,(IF(BF39=\"Y\",0,(IF(BG39=\"N\",0,(IF(BH39=\"R\",0,(IF(BH39=\"S\",AA39)))))))))","v":0},{"$f":"IF(M39=\"\",0,(IF(BF39=\"Y\",0,(IF(BG39=\"N\",0,(IF(BH39=\"\",0,(IF(BH39=\"S\",0,(IF(BH39=\"R\",AA39)))))))))))","v":0},{"$f":"(IF(AZ39=0,0,AZ39))*2","v":0},{"$f":"IF(N39=\"\",0,(IF(BF39=\"Y\",0,(IF(BG39=\"N\",0,(IF(BH39=\"S\",0,(IF(BH39=\"R\",AA39)))))))))","v":0},null,null,null,null,null,null,null,null,null,null,null,null,null,null,null,null,null,null,{"$f":"(IF(BT39=\"\",\"\",((BT39*50)^0.42)*0.64))","v":""},null,null,null,{"$f":"IF(BF39=\"\",\"\",(IF(BF39=\"N\",\"\",(IF(BF39=\"Y\",(IF(BN39=\"\",\"\",(IF($BN39<10,1,(IF($BN39<20,2,3))))*1.05)))))))","v":""},{"$f":"IF(BV39=\"\",\"\",(IF(BF39=\"N\",\"\",(IF(BF39=\"Y\",((100-$BV39)*0.04)+2)))))","v":""},null,{"$f":"IF(CA39=\"\",\"\",(IF(BF39=\"N\",\"\",(IF(BF39=\"Y\",(CA39*1.45))))))","v":""},null,{"$f":"IF(CC39=\"\",\"\",(IF(BF39=\"N\",\"\",(IF(BF39=\"Y\",(CC39*0.65))))))","v":""},null,{"$f":"IF(CE39=\"\",\"\",(IF(BF39=\"N\",\"\",(IF(BF39=\"Y\",(CE39*0.4))))))","v":""},null,{"$f":"IF(CG39=\"\",\"\",(IF(BF39=\"N\",\"\",(IF(BF39=\"Y\",(CG39*0.35))))))","v":""},{"$f":"IF(BY39=\"\",\"\",(SUM(BY39,BZ39,CB39,CD39,CF39,CH39)*SUM(BY39,BZ39,CB39,CD39,CF39,CH39)*SUM(BY39,BZ39,CB39,CD39,CF39,CH39)/55.5))","v":""},{"$f":"IF(CI39=\"\",\"\",IF(CI39<30,0,(IF(CI39>=30,1))))","v":""},{"$f":"IF(CI39=\"\",\"\",(IF(CJ39=1,CJ39=\"@\",(IF(CJ39=0,(IF($CI39<20,4*$CI39/550,(IF($CI39<30,6*$CI39/550,(IF($CI39<41,8*$CI39/550,(IF($CI39<61,10*$CI39/550,12*$CI39/550)))))))))))))","v":""},{"$f":"IF(CI39=\"\",\"\",((IF($CI39<20,4*$CI39/550,(IF($CI39<29.1,6*$CI39/550,(IF($CI39<40.1,8*$CI39/550,(IF($CI39<60.1,10*$CI39/550,12*$CI39/550))))))))*AA39))","v":""},{"$f":"IF(BF39=\"\",\"\",(IF(BF39=\"N\",\"\",(IF(T39=\"Y\",\"Y\",(IF(AA39=\"\",\"Y\",(IF(AA39=0,\"\",(IF(BF39=\"Y\",(AB39+AC39+AE39+AF39+AH39+AI39))))))))))))","v":""},{"$f":"IF(BG39=\"\",\"\",(IF(BG39=\"N\",\"\",(IF(BF39=\"Y\",\"\",(IF(Q39=\"Y\",\"\",(IF(BG39=\"Y\",(AW39+AY39+AZ39+BB39))))))))))","v":""},{"$f":"(IF(BF39=\"Y\",\"\",(IF(BG39=\"Y\",\"\",(IF(AL39>0,\"\",(IF(T39=\"Y\",\"Y\",(IF(AA39=\"\",\"\",(IF(AJ39>0,BI39,(IF(AK39>0,BI39,(AM39+AN39+AR39+AS39+AU39+AV39+AP39+AQ39)))))))))))))))","v":""},{"$f":"(IF(AA39=\"\",\"\",(IF(M39=\"\",\"\",(IF(Q39=\"Y\",\"\",(IF(BG39=\"N\",\"\",(IF(BF39=\"Y\",\"\",(IF(BG39=\"Y\",(AX39+BA39)))))))))))))","v":""},{"$f":"IF(AT39=0,\"\",(IF(AQ39=\"Y\",\"\",(AT39))))","v":""},{"$f":"IF(AA39=\"\",\"\",(IF(Q39=\"Y\",\"\",(IF(AR39=0,\"\",(AR39))))))","v":""},{"$f":"IF(AO39=0,\"\",(IF(Q39=\"Y\",\"\",(AO39*2))))","v":""},{"$f":"IF(AM39=0,\"\",(IF(Q39=\"Y\",\"\",(AM39*2))))","v":""},{"$f":"(IF(AE39=0,\"\",(IF(Q39=\"Y\",\"\",(AE39*2)))))","v":""},{"$f":"IF(AD39=0,\"\",(IF(Q39=\"Y\",\"\",(AD39))))","v":""},{"$f":"IF(BN39=\"\",\"\",(IF(S39=\"Y\",\"\",(IF(R39=\"Y\",\"\",(IF(Q39=\"Y\",\"\",(IF(T39=\"Y\",\"\",(IF(BF39=\"\",\"\",(IF(BF39=\"N\",\"\",(CL39))))))))))))))","v":""},{"$f":"IF(BF39=\"\",\"\",(IF(BF39=\"N\",\"\",(IF(BP39=\"\",\"\",(IF(R39=\"Y\",\"\",(IF(T39=\"Y\",\"\",(IF($CY$4=\"\",\"\",(IF(AA39=\"\",\"\",(PI()*((BP39/2)*(BP39/2)))/10000*AA39)))))))))))))","v":""}]
[null,null,null,null,null,null,null,null,null,null,null,null,null,null,null,null,null,null,null,null,null,{"$f":"IF(BF40=\"\",\"\",(IF(U40=\"\",\"\",(IF(BF40=\"N\",\"\",(IF(BF40=\"Y\",U40)))))))","v":""},null,{"$f":"IF(V40=\"\",\"\",(IF(BF40=\"N\",\"\",((V40*W40)/10000))))","v":""},null,null,null,0,0,0,0,0,0,0,0,0,0,0,0,0,0,0,0,0,0,0,0,0,0,0,0,0,0,0,null,null,null,null,null,null,null,null,null,null,null,null,null,null,null,null,null,null,"",null,null,null,"","",null,"",null,"",null,"",null,"","","","",{"$f":"IF(CI40=\"\",\"\",((IF($CI40<20,4*$CI40/550,(IF($CI40<29.1,6*$CI40/550,(IF($CI40<40.1,8*$CI40/550,(IF($CI40<60.1,10*$CI40/550,12*$CI40/550))))))))*AA40))","v":""},{"$f":"IF(BF40=\"\",\"\",(IF(BF40=\"N\",\"\",(IF(T40=\"Y\",\"Y\",(IF(AA40=\"\",\"Y\",(IF(AA40=0,\"\",(IF(BF40=\"Y\",(AB40+AC40+AE40+AF40+AH40+AI40))))))))))))","v":""},{"$f":"IF(BG40=\"\",\"\",(IF(BG40=\"N\",\"\",(IF(BF40=\"Y\",\"\",(IF(Q40=\"Y\",\"\",(IF(BG40=\"Y\",(AW40+AY40+AZ40+BB40))))))))))","v":""},{"$f":"(IF(BF40=\"Y\",\"\",(IF(BG40=\"Y\",\"\",(IF(AL40>0,\"\",(IF(T40=\"Y\",\"Y\",(IF(AA40=\"\",\"\",(IF(AJ40>0,BI40,(IF(AK40>0,BI40,(AM40+AN40+AR40+AS40+AU40+AV40+AP40+AQ40)))))))))))))))","v":""},{"$f":"(IF(AA40=\"\",\"\",(IF(M40=\"\",\"\",(IF(Q40=\"Y\",\"\",(IF(BG40=\"N\",\"\",(IF(BF40=\"Y\",\"\",(IF(BG40=\"Y\",(AX40+BA40)))))))))))))","v":""},"",{"$f":"IF(AA40=\"\",\"\",(IF(Q40=\"Y\",\"\",(IF(AR40=0,\"\",(AR40))))))","v":""},{"$f":"IF(AO40=0,\"\",(IF(Q40=\"Y\",\"\",(AO40*2))))","v":""},{"$f":"IF(AM40=0,\"\",(IF(Q40=\"Y\",\"\",(AM40*2))))","v":""},"","",{"$f":"IF(BN40=\"\",\"\",(IF(S40=\"Y\",\"\",(IF(R40=\"Y\",\"\",(IF(Q40=\"Y\",\"\",(IF(T40=\"Y\",\"\",(IF(BF40=\"\",\"\",(IF(BF40=\"N\",\"\",(CL40))))))))))))))","v":""},{"$f":"IF(BF40=\"\",\"\",(IF(BF40=\"N\",\"\",(IF(BP40=\"\",\"\",(IF(R40=\"Y\",\"\",(IF(T40=\"Y\",\"\",(IF($CY$4=\"\",\"\",(IF(AA40=\"\",\"\",(PI()*((BP40/2)*(BP40/2)))/10000*AA40)))))))))))))","v":""}]

{"sheet":"Summary","index":4,"n_rows":67,"n_cols":10,"rows_kept":67,"cut":false,"hidden":false,"merged":[[4,0,4,9],[5,0,5,8],[6,1,6,9],[8,0,8,9],[9,0,9,3],[9,4,9,7],[9,8,9,9],[0,0,0,6],[0,7,1,9],[1,0,1,6],[2,3,2,4],[2,7,2,9],[3,7,3,9],[13,0,13,1],[13,4,14,5],[13,6,14,6],[13,7,14,7],[13,8,14,8],[13,9,14,9],[14,0,14,2],[10,0,10,1],[10,4,10,5],[11,0,11,1],[11,4,11,5],[11,8,12,8],[11,9,12,9],[12,0,12,1],[12,4,12,5],[17,0,18,2],[17,3,17,4],[17,5,17,7],[17,8,17,9],[18,3,18,4],[18,5,18,7],[18,8,18,9],[15,2,15,3],[15,6,15,7],[15,8,16,8],[15,9,16,9],[16,0,16,1],[16,2,16,3],[16,4,16,5],[16,6,16,7],[21,1,21,9],[23,0,23,9],[24,0,24,3],[24,4,24,7],[24,8,25,9],[25,0,25,1],[25,4,25,5],[19,0,20,2],[19,3,19,4],[19,5,19,7],[19,8,19,9],[20,3,20,4],[20,5,20,7],[20,8,20,9],[26,0,26,1],[26,4,26,5],[26,8,29,9],[27,0,27,1],[27,4,27,5],[28,0,28,1],[28,2,28,7],[29,0,29,1],[29,2,29,7],[35,0,35,3],[35,5,35,6],[35,8,37,9],[36,0,36,3],[36,5,36,6],[37,0,37,3],[37,5,37,6],[30,1,30,9],[32,0,32,9],[33,0,33,7],[33,8,34,9],[34,0,34,3],[34,5,34,6],[41,4,41,5],[41,6,41,7],[42,0,42,3],[42,4,42,5],[42,6,42,7],[43,0,43,5],[43,6,43,7],[38,0,38,7],[38,8,39,9],[39,0,39,3],[39,4,39,5],[39,6,39,7],[40,0,40,3],[40,4,40,5],[40,6,40,7],[40,8,43,9],[41,0,41,3],[44,0,45,4],[44,5,44,6],[44,8,45,9],[45,5,45,6],[46,0,46,7],[46,8,47,9],[47,0,47,3],[47,4,47,5],[47,6,47,7],[48,0,48,3],[48,4,48,5],[48,6,48,7],[48,8,51,9],[49,4,49,5],[49,6,49,7],[50,0,50,3],[50,4,50,5],[50,6,50,7],[51,0,51,5],[56,0,56,9],[57,0,57,5],[57,6,57,9],[58,1,58,9],[60,0,60,3],[60,4,60,7],[60,8,60,9],[51,6,51,7],[52,0,53,4],[52,5,52,6],[52,8,53,9],[53,5,53,6],[54,1,54,9],[64,0,64,3],[64,8,64,9],[65,0,65,3],[65,8,65,9],[66,0,66,3],[66,8,66,9],[61,0,61,3],[61,4,62,7],[61,8,61,9],[62,0,62,3],[62,8,62,9],[63,0,63,3],[63,8,63,9]]}
["DEPARTMENT OF PLANNING TRANSPORT & INFRASTRUCTURE",null,null,null,null,null,null,{"$f":"Main!F2","v":"Project Name: "}]
[{"$f":"Main!A3","v":"SAFETY & SERVICE DIVISION            Revision - August 2018"}]
["SUMMARY\n",null,null,{"$f":"Main!E4","v":"VS 2017/???"},null,null,null,{"$f":"Main!F3","v":"Road Number : "}]
["GENERAL, REMOVALS,  APPROVALS AND SET ASIDES",null,null,null,null,null,null,{"$f":"Main!F4","v":"Location :"}]
["Commonwealth Environment Protection & Biodiversity Conservation Act (EPBC Act) "]
["Will the works significantly impact a declared Ramsar Wetland or any other threatened environment; and/or species (flora & fauna) which are covered by the EPBC Act?"]
["COMMENTS"]
[]
["NATIVE VEGETATION (Covered by the Native Vegetation Act)"]
["CLEARANCE",null,null,null,"CLEARANCE UNDER REGULATION 5(1)(lb)",null,null,null,"CLEARANCE OF:\nStructurally Unsound Vegetation\nAND/OR\nVeg. Within the Clearance Envelope"]
["IMPACT",null,"Number/\nHa","SEB\nHa","IMPACT",null,"Number/\nHa","OFFSET\nHa/No.","IMPACT","Number/\nHa"]
["REMOVAL (number)",null,{"$f":"Impact!AA17","v":0},{"$f":"Impact!CW29","v":0},"REMOVAL (number)",null,{"$f":"Impact!AF17","v":0},{"$f":"(IF(G12=\"\",\"\",G12*2))","v":0},"Number to be Removed",{"$f":"Impact!AH17","v":0}]
["MAJOR PRUNE (number)",null,{"$f":"Impact!AA18","v":0},{"$f":"Impact!CW17","v":0},"MAJOR PRUNE (number)",null,{"$f":"Impact!AF18","v":0},"N/A",null,{"$f":"BlankImpact!AH18","v":0}]
["Area to be Removed (ha)",null,{"$f":"Impact!AA19","v":0},{"$f":"Impact!CW7","v":0},"Area to be Removed (ha)",null,{"$f":"Impact!AF19","v":0},{"$f":"(IF(G14=\"\",\"\",G14*2))","v":0},"Number to be Major Pruned",{"$f":"Impact!AH18","v":0}]
["TOTAL SEB",null,null,{"$f":"SUM(D12:D14)","v":0},null,null,null,null,null,{"$f":"BlankImpact!AH20","v":0}]
["IMPACT LEVEL",3,null,null,"IMPACT LEVEL",null,null,null,"APPROVING AUTHORITY","PEA"]
["APPROVING AUTHORITY",null,"PEA/GMID endorse, NVMU approve",null,"APPROVING AUTHORITY",null,"PEA/GMID endorse, NVMU approve"]
["PAYMENT INTO NVC FUND OPTION\nA Minimum Payment of $500 is Required",null,null,"PAYMENT AMOUNT FOR SCATTERED TREES",null,"PAYMENT AMOUNT FOR AREA",null,null,"TOTAL PAYMENT INTO THE  NVC FUND"]
[null,null,null,{"$f":"Impact!$DB$12","v":0},null,{"$f":"Impact!$DE$12","v":0},null,null,{"$f":"IF(SUM(D19,F19)=0,0,(IF(AND(D19+F19>0,D19+F19<500),500,(D19+F19))))","v":0}]
["PAYMENT INTO AMENITY PLANTING FUND OPTION  (Applies to clearance under Regulation 5(1)(lb) only)",null,null,"PAYMENT AMOUNT FOR SCATTERED TREES",null,"PAYMENT AMOUNT FOR AREA",null,null,"TOTAL PAYMENT INTO THE AMENITY PLANTING FUND"]
[null,null,null,{"$f":"H12*96","v":0},null,{"$f":"H14*5000","v":0},null,null,{"$f":"SUM(D21,F21)","v":0}]
["COMMENTS"]
[]
["REGULATED OR REGULATED SIGNIFICANT TREES (Covered by the Development Act)\nExcluding those trees also covered by the Native Vegetation Act"]
["REGULATED TREES",null,null,null,"REGULATED SIGNIFICANT TREES",null,null,null,"APPROVING AUTHORITY"]
["IMPACT",null,"Number","OFFSET","IMPACT",null,"Number","OFFSET"]
["REMOVAL",null,{"$f":"Impact!BB17","v":0},{"$f":"C27*2","v":0},"REMOVAL",null,{"$f":"Impact!BB19","v":0},{"$f":"G27*3","v":0},"Manager, Technical Services & DAC"]
["MAJOR PRUNE",null,{"$f":"Impact!BB18","v":0},"N/A","MAJOR PRUNE",null,{"$f":"Impact!BB20","v":0},"N/A"]
["TOTAL DAC OFFSET\n(Number)",null,"PAYMENT INTO PLANNING & DEVELOPMENT FUND OPTION"]
[{"$f":"D27+H27","v":0},null,{"$f":"(A30)*96","v":0}]
["COMMENTS"]
[]
["OTHER VEGETATION"]
["Declared/Environmental Weeds plus any Self-seeded Plant\n(Excluding plants as defined under the \"Notes\" for this section in Vegetation Removal Policy)",null,null,null,null,null,null,null,"APPROVING AUTHORITY"]
["IMPACT",null,null,null,"Number/Ha\n(Approval required)","Number\n(undersize-no approval)",null,"OFFSET"]
["Number of trees/shrubs to be Removed",null,null,null,{"$f":"(Impact!AA20)","v":0},{"$f":"(Impact!AB20)","v":0},null,"N/A","SEMO or Environment Officer"]
["Number of trees/shrubs to be Major Pruned",null,null,null,{"$f":"(Impact!AA21)","v":0},{"$f":"(Impact!AB21)","v":0},null,"N/A"]
["Area  to be Removed (ha)",null,null,null,{"$f":"(Impact!AA22/10000)","v":0},"N/A",null,"N/A"]
["Amenity Planting or has Amenity Value",null,null,null,null,null,null,null,"APPROVING AUTHORITY"]
["IMPACT",null,null,null,"Number/Ha",null,"OFFSET\n(1:1)"]
["Number of trees/shrubs to be Removed",null,null,null,{"$f":"(Impact!AA23)","v":0},null,{"$f":"E41","v":0},null,"SEMO or Manager, Technical Services"]
["Number of trees/shrubs to be Major Pruned",null,null,null,{"$f":"(Impact!AA24)","v":0},null,"N/A"]
["Area of to be Removed (ha)",null,null,null,{"$f":"(Impact!AA25/10000)","v":0},null,{"$f":"E43","v":0}]
["PAYMENT INTO AMENITY PLANTING FUND OPTION",null,null,null,null,null,{"$f":"(G41*96)+(G43*5000)","v":0}]
["CLEARANCE OF AMENITY VEGETATION WHICH IS: Structurally Unsound; Dead; and/or Within the Clearance Envelope (No offset is required)",null,null,null,null,"Removals - No.",null,{"$f":"(Impact!AH23)","v":0},"SEMO"]
[null,null,null,null,null,"Major Prune - No.",null,{"$f":"(Impact!AH24)","v":0}]
["Native Vegetation Not Covered by the NVA",null,null,null,null,null,null,null,"APPROVING AUTHORITY"]
["IMPACT",null,null,null,"Number/Ha",null,"OFFSET\n(2:1)"]
["Number of trees/shrubs to be Removed",null,null,null,{"$f":"(Impact!AA26)","v":0},null,{"$f":"E49*2","v":0},null,"SEMO or Manager, Technical Services"]
["Number of trees/shrubs to be Major Pruned",null,null,null,{"$f":"(Impact!AA27)","v":0},null,"N/A"]
["Area to be Removed (ha)",null,null,null,{"$f":"(Impact!AA28/10000)","v":0},null,{"$f":"E51*2","v":0}]
["PAYMENT INTO AMENITY PLANTING FUND OPTION",null,null,null,null,null,{"$f":"(G49*96)+(G51*5000)","v":0}]
["CLEARANCE OF NATIVE VEGETATION NOT COVERED BY THE NVA WHICH IS:\nStructurally Unsound and/or Within the Clearance Envelope (No offset is required)",null,null,null,null,"Removals - No.",null,{"$f":"(Impact!AH26)","v":0},"SEMO"]
[null,null,null,null,null,"Major Prune - No.",null,{"$f":"(Impact!AH27)","v":0}]
["COMMENTS"]
[]
["MONITORING (To be Added to the Monitoring Program)"]
["Number of trees/shrubs recommended for ongoing Monitoring",null,null,null,null,null,{"$f":"Impact!BB26","v":0}]
["COMMENTS"]
[]
["LOCAL GOVERNMENT COUNCIL AREA(S)",null,null,null,"PHYTOPHTHORA",null,null,null,"NRM BOARD"]
[{"$f":"IF(Main!F9=\"\",\"\",(Main!F9))","v":"1  -  "},null,null,null,"This site has been assessed as a (tick relevant box) :"]
[{"$f":"IF(Main!F10=\"\",\"\",(Main!F10))","v":"2  -  "}]
[{"$f":"IF(Main!F11=\"\",\"\",(Main!F11))","v":"3  -  "}]
[{"$f":"IF(Main!F12=\"\",\"\",(Main!F12))","v":"4  -  "}]
[{"$f":"IF(Main!F13=\"\",\"\",(Main!F13))","v":"5  -  "}]
[{"$f":"IF(Main!F14=\"\",\"\",(Main!F14))","v":"6  -  "}]

{"sheet":"Vegetation Removal Request","index":5,"n_rows":76,"n_cols":19,"rows_kept":76,"cut":false,"hidden":false,"merged":[[0,0,0,8],[0,10,0,14],[0,15,0,18],[1,0,1,8],[1,10,1,14],[1,15,3,18],[2,0,5,9],[2,10,2,14],[3,10,3,14],[4,10,4,14],[4,15,4,18],[5,10,5,14],[5,15,6,18],[6,10,6,14],[6,0,6,2],[6,3,6,5],[6,6,6,9],[7,0,7,2],[10,0,11,5],[10,6,10,9],[10,10,11,12],[10,13,11,15],[10,16,11,18],[11,6,11,9],[7,10,8,12],[7,13,8,15],[7,16,8,18],[8,0,8,9],[9,0,9,5],[9,6,9,9],[9,10,9,12],[9,13,9,15],[9,16,9,18],[7,3,7,5],[7,6,7,9],[17,10,17,13],[18,8,19,9],[18,10,18,13],[19,10,19,13],[20,8,22,9],[20,10,20,13],[12,0,12,7],[12,8,12,18],[13,0,20,7],[13,8,14,9],[13,10,14,13],[13,14,13,16],[13,17,13,18],[15,8,17,9],[15,10,15,13],[16,10,16,13],[21,0,21,7],[21,10,21,13],[22,0,23,7],[22,10,22,13],[23,8,23,13],[24,0,24,9],[24,10,26,18],[25,0,26,5],[25,6,25,7],[25,8,26,9],[27,8,27,9],[27,10,33,18],[28,0,28,5],[28,8,28,9],[29,0,30,5],[29,6,30,6],[29,7,30,7],[27,0,27,5],[34,0,34,5],[34,8,34,9],[34,10,34,12],[34,13,34,18],[35,0,35,16],[36,0,36,9],[36,10,36,15],[36,16,36,18],[29,8,30,9],[31,0,32,5],[31,6,32,6],[31,7,32,7],[31,8,32,9],[33,0,33,5],[33,8,33,9],[40,17,40,18],[41,0,41,18],[42,0,42,13],[42,14,42,18],[43,0,43,13],[43,14,43,18],[37,0,37,9],[37,10,37,18],[38,0,40,9],[38,10,38,14],[38,15,38,16],[38,17,38,18],[39,10,40,14],[39,15,39,16],[39,17,39,18],[40,15,40,16],[49,0,49,13],[49,14,49,18],[52,0,52,18],[57,0,57,1],[44,0,44,13],[44,14,44,18],[45,0,45,13],[45,14,45,18],[47,0,47,18],[48,0,48,13],[48,14,48,18],[56,0,56,5]]}
["DEPARTMENT OF PLANNING TRANSPORT & INFRASTRUCTURE",null,null,null,null,null,null,null,null,null,"LGA",null,null,null,null,"VEGETATION SURVEY NO."]
["SAFETY & SERVICE DIVISION",null,null,null,null,null,null,null,null,null,"1  -  ",null,null,null,null,{"$f":"Main!E4","v":"VS 2017/???"}]
["VEGETATION REMOVAL REQUEST",null,null,null,null,null,null,null,null,null,"2  - "]
[null,null,null,null,null,null,null,null,null,null,"3  - "]
[null,null,null,null,null,null,null,null,null,null,"4  -  ",null,null,null,null,"VEGETATION SURVEY FILE"]
[null,null,null,null,null,null,null,null,null,null,"5  -  ",null,null,null,null,{"$f":"Main!A7","v":"File No :  2017/"}]
["REQUESTING OFFICER",null,null,"REQUESTING COMPANY",null,null,"DPTI PROJECT MANAGER",null,null,null,"6  -  "]
[null,null,null,null,null,null,null,null,null,null,"SHAPEFILE (KNET#)",null,null,"START \nMM/GPS",null,null,"END\nMM/GPS"]
[{"$f":"Main!F2","v":"Project Name: "}]
[{"$f":"Main!F3","v":"Road Number : "},null,null,null,null,null,"NRM BOARD(S)"]
[{"$f":"Main!F4","v":"Location :"},null,null,null,null,null,{"$f":"IF(Summary!I62=\"\",\"\",Summary!I62)","v":""}]
[null,null,null,null,null,null,{"$f":"IF(Summary!I63=\"\",\"\",Summary!I63)","v":""}]
["PROJECT DESCRIPTION & REASON FOR VEGETATION REMOVAL",null,null,null,null,null,null,null,"IMPACTS & OFFSETS"]
[null,null,null,null,null,null,null,null,"Legislation or Policy",null,"VEGETATION APPROVAL CATEGORY",null,null,null,"IMPACTS",null,null,"OFFSET"]
[null,null,null,null,null,null,null,null,null,null,null,null,null,null,"Removal\n(Number)","Major Prune\n(Number)","Removal\n(Area - ha)","Number","Area (ha) or SEB Points"]
[null,null,null,null,null,null,null,null,"Native Vegetation Act",null,"Clearance under Safety Regulation 5(1)(lb)",null,null,null,{"$f":"Impact!AF17","v":0},{"$f":"Impact!AF18","v":0},{"$f":"Impact!AF19","v":0},{"$f":"Summary!H12","v":0},{"$f":"Summary!H14","v":0}]
[null,null,null,null,null,null,null,null,null,null,"Clearance for Maintenance (eg structurally unsound; within the clearance envelope)",null,null,null,{"$f":"Impact!AH17","v":0},{"$f":"Impact!AH18","v":0},"N/A","N/A","N/A"]
[null,null,null,null,null,null,null,null,null,null,"Clearance for New Works ",null,null,null,{"$f":"Impact!AA17","v":0},{"$f":"Impact!AA18","v":0},{"$f":"Impact!AA19","v":0},"N/A",{"$f":"Summary!D15","v":0}]
[null,null,null,null,null,null,null,null,"Development Act",null,"Regulated Trees",null,null,null,{"$f":"Impact!BB17","v":0},{"$f":"Impact!BB18","v":0},"N/A",{"$f":"Summary!D27","v":0},"N/A"]
[null,null,null,null,null,null,null,null,null,null,"Regulated Significant Trees",null,null,null,{"$f":"Impact!BB19","v":0},{"$f":"Impact!BB20","v":0},"N/A",{"$f":"Summary!H27","v":0},"N/A"]
[null,null,null,null,null,null,null,null,"DPTI Vegetation Removal Policy",null,"Declared/Environmental Weeds and/or Self-seeded Plants",null,null,null,{"$f":"Impact!AA20","v":0},{"$f":"Impact!AA21","v":0},{"$f":"Summary!E38","v":0},"N/A","N/A"]
["TYPE OF VEGETATION IMPACTED",null,null,null,null,null,null,null,null,null,"Amenity Planting (including vegetation incidental to maintenance eg structurally unsound)",null,null,null,{"$f":"Impact!AA23+Impact!AH23","v":0},{"$f":"Impact!AA24+Impact!AH24","v":0},{"$f":"Summary!E43","v":0},{"$f":"Summary!E41","v":0},{"$f":"Summary!E43","v":0}]
["eg Eucalyptus fasciculosa Open Woodland (Area) or \nEucalyptus camaldulensis (Scattered Tree/s)\n",null,null,null,null,null,null,null,null,null,"Native Vegetation not covered by the Native Vegetation Act (including vegetation incidental to maintenance eg structurally unsound)",null,null,null,{"$f":"Impact!AA26+Impact!AH26","v":0},{"$f":"Impact!AA27+Impact!AH27","v":0},{"$f":"Summary!E51","v":0},{"$f":"Summary!G49","v":0},{"$f":"Summary!G51","v":0}]
[null,null,null,null,null,null,null,null,"TOTAL",null,null,null,null,null,{"$f":"SUM(O16:O23)","v":0},{"$f":"SUM(P16:P23)","v":0},{"$f":"SUM(Q16:Q23)","v":0},{"$f":"SUM(R16:R23)","v":0},{"$f":"SUM(S16:S23)","v":0}]
["DELIVERY OF OFFSETS",null,null,null,null,null,null,null,null,null,"OFFSET DELIVERY DETAILS & OTHER COMMENTS\n(Note to start another line within a cell press Alt Enter)"]
["OPTIONS FOR THE DELIVERY OF OFFSET",null,null,null,null,null,"OFFSET",null,"Amount ($)"]
[null,null,null,null,null,null,"Number","SEB Area (ha) or\nSEB Points"]
["Payment into the Native Vegetation Fund",null,null,null,null,null,"N/A"]
["Payment into the Planning & Development Fund",null,null,null,null,null,null,"N/A",{"$f":"G29*96","v":0}]
["On Ground Works",null,null,null,null,null,null,null,"N/A"]
[]
["Payment to a Third Party"]
[]
["Payment into the Amenity Planting Fund (DPTI)*#",null,null,null,null,null,null,null,{"$f":"(G34*96)+(H34*5000)","v":0}]
["TOTAL",null,null,null,null,null,{"$f":"SUM(G28:G34)","v":0},{"$f":"SUM(H28:H34)","v":0},{"$f":"SUM(I28:I34)","v":0},null,"eg 7500 22027890 51000",null,null,"*Insert Budget Line; Resp; Project & Task Numbers if a Payment Option is selected"]
["# Note - for payments into the Amenity Planting Fund, the project will be charged at the END OF FINANCIAL YEAR"]
["DEPARTMENT OF PLANNING TRANSPORT & INFRASTRUCTURE",null,null,null,null,null,null,null,null,null,"DPTI Environmental Planning File No.",null,null,null,null,null,{"$f":"(IF(C7=\"\",\"\",C7))","v":""}]
["SAFETY AND SERVICES DIVISION",null,null,null,null,null,null,null,null,null,{"$f":"Main!F2","v":"Project Name: "}]
["VEGETATION REMOVAL REQUEST",null,null,null,null,null,null,null,null,null,{"$f":"Main!F3","v":"Road Number : "},null,null,null,null,"Start MM/GPS",null,"End MM/GPS"]
[null,null,null,null,null,null,null,null,null,null,{"$f":"Main!F4","v":"Location :"},null,null,null,null,{"$f":"(IF(N10=\"\",\"\",N10))","v":""},null,{"$f":"(IF(Q10=\"\",\"\",Q10))","v":""}]
[null,null,null,null,null,null,null,null,null,null,null,null,null,null,null,{"$f":"(IF(N11=\"\",\"\",N11))","v":""},null,{"$f":"(IF(Q11=\"\",\"\",Q11))","v":""}]
["EXTERNAL APPROVALS"]
["Native Vegetation Council (Native Vegetation Act,1991)"]
["Development Assessment Commission (Development Act,1993)"]
["Minister for Aboriginal Affairs (Aboriginal Heritage Act,1988)"]
["Federal Environment Minister (EPBC Act,1999)"]
[]
["EXTERNAL CONSULTATION"]
["The local Council(s) has been consulted on the removal of the vegetation and the offset, if located in the road reserve."]
[]
[]
[]
["The removal of the vegetation proposed above has been minimised and is considered necessary and unavoidable. Approval for removal is recommended:"]
[]
[]
[]
["Project Manager"]
["     /     /"]
[]
[]
["To the Principal Environmental Advisor"]
["The above request has been endorsed."]
[]
[]
[]
["Senior Environmental Advisor"]
["     /     /"]
[]
[]
["To the Project Manager"]
["The above request has been approved."]
[]
[]
[]
["Principal Environmental Advisor"]
["     /     /"]

{"sheet":"Native Veg List","index":6,"n_rows":38,"n_cols":110,"rows_kept":38,"cut":false,"hidden":false,"merged":[[6,31,19,31],[6,32,19,32],[6,33,19,33],[0,75,18,75],[6,37,19,37],[6,38,19,38],[6,39,19,39],[0,0,0,4],[0,16,18,16],[0,17,18,17],[0,18,18,18],[0,19,18,19],[0,21,18,21],[1,0,1,4],[0,22,18,22],[0,23,6,23],[12,1,18,1],[12,2,18,2],[0,76,5,85],[6,80,18,80],[6,81,18,81],[6,82,18,82],[6,83,18,83],[0,62,18,62],[0,63,18,63],[0,64,18,64],[0,65,18,65],[0,66,18,66],[0,67,18,67],[1,109,4,109],[5,0,6,4],[5,20,18,20],[5,98,18,98],[5,99,18,99],[5,100,18,100],[6,12,14,15],[6,27,19,27],[6,28,19,28],[6,29,19,29],[0,86,18,86],[0,87,18,87],[0,88,14,88],[0,89,18,89],[0,98,4,100],[0,101,4,102],[17,88,18,88],[0,68,18,68],[0,69,7,69],[0,73,18,73],[0,74,18,74],[10,109,18,109],[11,101,12,102],[12,0,18,0],[13,101,13,102],[14,101,14,102],[15,88,16,88],[15,101,18,102],[16,4,18,4],[6,84,18,84],[6,85,18,85],[7,0,11,4],[7,23,9,23],[8,69,18,69],[10,23,18,23],[6,52,19,52],[6,53,19,53],[6,76,18,76],[6,77,18,77],[6,78,18,78],[6,79,18,79],[6,46,19,46],[6,47,19,47],[0,24,18,24],[0,25,18,25],[0,26,18,26],[0,61,18,61],[6,30,19,30],[34,21,34,25],[34,86,34,99],[34,101,34,102],[35,101,35,102],[36,101,36,102],[19,1,19,26],[31,21,31,25],[31,86,31,99],[31,101,31,102],[32,101,32,102],[33,101,33,102],[6,48,19,48],[6,49,19,49],[6,50,19,50],[6,51,19,51],[6,40,19,40],[6,41,19,41],[6,42,19,42],[6,43,19,43],[6,44,19,44],[6,45,19,45],[6,34,19,34],[6,35,19,35],[6,36,19,36]]}
[{"$f":"Main!A2","v":"DEPARTMENT OF PLANNING, TRANSPORT &  INFRASTRUCTURE"},null,null,null,null,null,null,null,null,null,null,null,null,null,null,null,"Off-set is Negated - eg DEAD vegetation with no habitat value (Y/N)","Veg is structurally unsound/within the Clearance Envelope etc (Y/N)","REGULATION 5(1)(lb) APPLIES (Y/N)","Area reporting selected in lieu of individual reporting (Y/N)",null,"AREA TO BE REMOVED SUBJECT TO THE NVA","NVA SEB Multipliation Factor (Condition)",{"$f":"SUM($X$20:$X$4064)","v":0},"EASTING","NORTHING","NUMBER OF SCATTERED TREES TO BE REMOVED (If a number is shown in \"Area\" column, an area Impact/SEB has been used in lieu of individual counts)",null,null,null,null,null,null,null,null,null,null,null,null,null,null,null,null,null,null,null,null,null,null,null,null,null,null,null,"A","B","C","D","E","F",{"$f":"SUM($BI$33:$BI$4912)","v":0},"SINGLE-STEMMED(S) OR  MULTI-STEMMED(M) SPECIMEN","BUTT DIA (M). IN GROUP AND/OR MS SITUATIONS INSERT HIGHEST RANGE READING","BUTT DIA (M). ONLY USE THIS COLUMN IN A GROUP AND/OR MS SITUATION INSERT LOWEST  RANGE","CIRCUMFERENCE (M) DEVELOPMENT ACT REQUIREMENT ONLY","HEIGHT (m) - In GROUP situations insert HIGHEST range reading.","HEIGHT (m) - In GROUP situations insert LOWEST range reading.","SPREAD (m) - In GROUP situations insert WIDEST range reading.","SPREAD (m) - In GROUP situations insert NARROWEST range reading.","E\nG\nF\nP\nD",null,null,null,"%  DIEBACK","HOLLOWS (NUMBER)","HOLLOW ENTRANCE SIZE (METRES)","WILDLIFE HABITAT VALUE CATEGORIES\n(LABELLED 1- 6)",null,null,null,null,null,null,null,null,null,"TOTAL SCORE","RECOMMENDATION","A 'FALSE' reading indicates Refusal under normal circumstances.","SEB Offset Area Requirement (total removal scattered trees)","APPROVALS",null,null,"SET ASIDE",null,null,null,null,"OFF-SETS",null,null,"LGC AVERAGE LAND VALUE ",null,"Calculations for Scattered Tree Payment for each LGC",null,null,"Calculations for Area Payment for each LGC",null,null,"COUNCIL(S)"]
[{"$f":"Main!A3","v":"SAFETY & SERVICE DIVISION            Revision - August 2018"},null,null,null,null,null,null,null,null,null,null,null,null,null,null,null,null,null,null,null,null,null,null,null,null,null,null,null,null,null,null,null,null,null,null,null,null,null,null,null,null,null,null,null,null,null,null,null,null,null,null,null,null,null,null,null,null,null,null,null,null,null,null,null,null,null,null,null,null,null,null,null,null,null,null,null,null,null,null,null,null,null,null,null,null,null,null,null,null,null,null,null,null,null,null,null,null,null,null,null,null,null,null,null,null,null,null,null,null,{"$f":"Main!$F$9","v":"1  -  "}]
[]
[]
[]
[{"$f":"(IF(Main!$E$4=\"\",\"\",Main!$E$4))","v":"VS 2017/???"},null,null,null,null,null,null,null,null,null,null,null,null,null,null,null,null,null,null,null,"AREA OF VEGETATION TO BE REMOVED (m2).",null,null,null,null,null,null,null,null,null,null,null,null,null,null,null,null,null,null,null,null,null,null,null,null,null,null,null,null,null,null,null,null,null,null,null,null,null,null,null,null,null,null,null,null,null,null,null,null,null,null,null,null,null,null,null,null,null,null,null,null,null,null,null,null,null,null,null,null,null,null,null,null,null,null,null,null,null,"Number - Regulation 5(1)(lb) Only - 2:1","Area (ha)\n(Condition Score x Area)","SEB Offset Area Requirement for Scattered Trees (Ha)",1,{"$f":"(IF(Impact!CY6=\"\",\"\",Impact!CY6))","v":11519},null,null,null,null,null,null,{"$f":"Main!$F$10","v":"2  -  "}]
[null,null,null,null,null,null,"CLEARANCE ENVELOPE (S - STANDARD, R - RESTRICTED)","SIDE OF ROAD (L - LEFT, R - RIGHT)","Width of the Travelway","Distance - Centreline to Edgeline","Distance of Tree from the Edgeline\n(Show in RED if behind Guardrailing)","Clearance @ Edgeline OR Edge of Envelope","IMPACT OR RECOMMENDED ACTION",null,null,null,null,null,null,null,null,null,null,null,null,null,null,"STANDARD CLEARANCE\nREMOVAL \nNumber of Native Veg","STANDARD CLEARANCE\nMAJOR PRUNE\nNumber of Native Veg","Area of Native Veg","Regulation 5(1)(lb)\nREMOVAL \nNumber of Native Veg","Regulation 5(1)(lb)\nMAJOR PRUNE\nNumber of Native Veg","Regulation 5(1)(lb)\nArea of Native Veg","STRUCTURALLY UNSOUND\nREMOVAL \nNumber of Native Veg","STRUCTURALLY UNSOUND\nMAJOR PRUNE\nNumber of Native Veg","REMOVAL\nNumber of weeds and \"others\" excluding amenity planting","MAJOR PRUNE\nNumber of weeds and \"others\" excluding amenity planting","AREA OF WEEDS EXCLUDING AMENITY","REMOVAL\nNumber - Native Vegetation Not covered by ACT","MAJOR PRUNE\nNumber - Native Vegetation Not covered by ACT","Area - Native Vegetation Not covered by ACT","STRUCTURALLY UNSOUND\nREMOVAL \nNumber - Native Vegetation Not covered by ACT","STRUCTURALLY UNSOUND\nMAJOR PRUNE\nNumber - Native Vegetation Not covered by ACT","STANDARD CLEARANCE\nREMOVAL\nNumber - Amenity Planting","STANDARD CLEARANCE\nMAJOR PRUNE\nNumber - Amenity Planting","Area - Amenity Planting","STRUCTURALLY UNSOUND\nREMOVAL \nNumber - Amenity Planting","STRUCTURALLY UNSOUND\nMAJOR PRUNE\nNumber - Amenity Planting","REMOVAL\nNumber - Regulated Significant Trees","SEB\nNumber - Regulated Significant Trees","MAJOR PRUNE\nNumber - Regulated Significant Trees","REMOVAL\nNumber - Regulated Trees","SEB\nNumber - Regulated Trees","MAJOR PRUNE\nNumber - Regulated Trees",null,null,null,null,null,null,null,null,null,null,null,null,null,null,null,null,null,null,null,null,null,null,"1. HEIGHT (WEIGHTED)","2. HEALTH (WEIGHTED)","HOLLOWS 1, 2 OR 3 POINTS","3. HOLLOWS (WEIGHTED)","SUITABILITY FOR THREATENED SPECIES ","4. THREATENED SPECIES (WEIGHTED)","DENSITY","5. DENSITY  (WEIGHTED)","PROXIMITY TO OTHER VEG","6. PROXIMITY TO OTHER VEG. (WEIGHTED)",null,null,null,null,null,null,null,null,null,null,null,null,null,null,null,2,{"$f":"(IF(Impact!CY7=\"\",\"\",Impact!CY7))","v":""},null,null,null,null,null,null,{"$f":"Main!$F$11","v":"3  -  "}]
["Native Vegetation Impacts\nNative Vegetation Act, 1991",null,null,null,null,null,null,null,null,null,null,null,null,null,null,null,null,null,null,null,null,null,null,"TOTAL",null,null,null,null,null,null,null,null,null,null,null,null,null,null,null,null,null,null,null,null,null,null,null,null,null,null,null,null,null,null,null,null,null,null,null,null,"TOTAL",null,null,null,null,null,null,null,null,null,null,null,null,null,null,null,null,null,null,null,null,null,null,null,null,null,null,null,null,null,null,null,null,null,null,null,null,null,null,null,null,3,{"$f":"(IF(Impact!CY8=\"\",\"\",Impact!CY8))","v":""},null,null,null,null,null,null,{"$f":"Main!$F$12","v":"4  -  "}]
[null,null,null,null,null,null,null,null,null,null,null,null,null,null,null,null,null,null,null,null,null,null,null,null,null,null,null,null,null,null,null,null,null,null,null,null,null,null,null,null,null,null,null,null,null,null,null,null,null,null,null,null,null,null,null,null,null,null,null,null,null,null,null,null,null,null,null,null,null,"HEALTH & CONDITION *",null,null,null,null,null,null,null,null,null,null,null,null,null,null,null,null,null,null,null,null,null,null,null,null,null,null,null,null,null,null,null,4,{"$f":"(IF(Impact!CY9=\"\",\"\",Impact!CY9))","v":""},{"$f":"IF(CY9=\"\",\"\",(SUMIF(A33:A34,\"1\",CW33:CW34)+(SUMIF(A36:A36,\"1\",CW36:CW36)/100*20)))","v":""},{"$f":"IF(CY9=\"\",\"\",(SUMIF(A33:A34,\"1\",CX33:CX34)+(SUMIF(A36:A36,\"1\",CX36:CX36)*20/100)))","v":""},{"$f":"IF(CY9=\"\",\"\",(($CZ$9*$CY$9)+(800*$DA$9)))","v":""},{"$f":"IF(CY9=\"\",\"\",(SUMIF(A33:A34,\"1\",CP33:CP34)))","v":""},{"$f":"IF(CY9=\"\",\"\",(SUMIF(A33:A34,\"1\",V33:V34)/10000))","v":""},{"$f":"IF(CY9=\"\",\"\",(($DC$9*$CY$9)+(800*$DD$9)))","v":""},{"$f":"Main!$F$13","v":"5  -  "}]
[null,null,null,null,null,null,null,null,null,null,null,null,null,null,null,null,null,null,null,null,null,null,null,null,null,null,null,null,null,null,null,null,null,null,null,null,null,null,null,null,null,null,null,null,null,null,null,null,null,null,null,null,null,null,null,"AMENITY PLANTING","NATIVE VEGETATION","SUBJECT TO NATIVE VEGETATION ACT","SUBJECT TO DEVELOPMENT ACT",null,"NO IN GROUP WITH BUTT DIA. 0.15+ OR MS 0.10+",null,null,null,null,null,null,null,null,null,null,null,null,null,null,null,null,null,null,null,null,null,null,null,null,null,null,null,null,null,null,null,null,null,null,null,null,null,null,null,null,5,{"$f":"(IF(Impact!CY10=\"\",\"\",Impact!CY10))","v":""},null,null,null,null,null,null,{"$f":"Main!$F$14","v":"6  -  "}]
[null,null,null,null,null,null,null,null,null,null,null,null,null,null,null,null,null,null,null,null,null,null,null,"NVA SEB for AREA (HA)",null,null,null,null,null,null,null,null,null,null,null,null,null,null,null,null,null,null,null,null,null,null,null,null,null,null,null,null,null,null,null,null,null,null,null,null,null,null,null,null,null,null,null,null,null,null,null,null,null,null,null,null,null,null,null,null,null,null,null,null,null,null,null,null,null,null,null,null,null,null,null,null,null,null,null,null,null,6,{"$f":"(IF(Impact!CY11=\"\",\"\",Impact!CY11))","v":""},null,null,null,null,null,null,"COMMENTS"]
[null,null,null,null,null,null,null,null,null,null,null,null,null,null,null,null,null,null,null,null,null,null,null,null,null,null,null,null,null,null,null,null,null,null,null,null,null,null,null,null,null,null,null,null,null,null,null,null,null,null,null,null,null,null,null,null,null,null,null,null,null,null,null,null,null,null,null,null,null,null,null,null,null,null,null,null,null,null,null,null,null,null,null,null,null,null,null,null,null,null,null,null,null,null,null,null,null,null,null,null,null,"NRM BOARD(S)",null,{"$f":"IF(CY12=\"\",\"\",(SUMIF(A33:A34,\"2\",CW33:CW34)+(SUMIF(#REF!,\"2\",#REF!)/100*20)))","v":""},{"$f":"IF(CY12=\"\",\"\",(SUMIF(A33:A34,\"2\",CX33:CX34)+(SUMIF(A36:A36,\"2\",CX36:CX36)*20/100)))","v":""},{"$f":"IF(CY12=\"\",\"\",(($CZ$12*$CY$12)+(800*$DA$12)))","v":""},{"$f":"IF(CY12=\"\",\"\",(SUMIF(A33:A34,\"2\",CP33:CP34)))","v":""},{"$f":"IF(CY12=\"\",\"\",(SUMIF(A33:A34,\"2\",V33:V34)/10000))","v":""},{"$f":"IF(CY12=\"\",\"\",(($DC$12*$CY$12)+(800*$DD$12)))","v":""}]
["LGC (ALLOCATED NUMBER)","PLAN REFERENCE OR MM LOCATION","PHOTO REFERENCE",null,{"$f":"Main!$F$2","v":"Project Name: "}]
[null,null,null,null,{"$f":"Main!$F$3","v":"Road Number : "},null,null,null,null,null,null,null,null,null,null,null,null,null,null,null,null,null,null,null,null,null,null,null,null,null,null,null,null,null,null,null,null,null,null,null,null,null,null,null,null,null,null,null,null,null,null,null,null,null,null,null,null,null,null,null,null,null,null,null,null,null,null,null,null,null,null,null,null,null,null,null,null,null,null,null,null,null,null,null,null,null,null,null,null,null,null,null,null,null,null,null,null,null,null,null,null,{"$f":"(IF(Summary!I62=\"\",\"\",Summary!I62))","v":""},null,{"$f":"IF(CY14=\"\",\"\",(SUMIF(A33:A34,\"3\",CW33:CW34)+(SUMIF(A36:A36,\"3\",CW36:CW36)/100*20)))","v":""},{"$f":"IF(CY14=\"\",\"\",(SUMIF(A33:A34,\"3\",CX33:CX34)+SUMIF(A36:A36,\"3\",CX36:CX36)*20/100))","v":""},{"$f":"IF(CY14=\"\",\"\",(($CZ$14*$CY$14)+(800*$DA$14)))","v":""},{"$f":"IF(CY14=\"\",\"\",(SUMIF(A33:A34,\"3\",CP33:CP34)))","v":""},{"$f":"IF(CY14=\"\",\"\",(SUMIF(A33:A34,\"3\",V33:V34)/10000))","v":""},{"$f":"IF(CY14=\"\",\"\",(($DC$14*$CY$14)+(800*$DD$14)))","v":""}]
[null,null,null,null,{"$f":"Main!$F$4","v":"Location :"},null,null,null,null,null,null,null,null,null,null,null,null,null,null,null,null,null,null,null,null,null,null,null,null,null,null,null,null,null,null,null,null,null,null,null,null,null,null,null,null,null,null,null,null,null,null,null,null,null,null,null,null,null,null,null,null,null,null,null,null,null,null,null,null,null,null,null,null,null,null,null,null,null,null,null,null,null,null,null,null,null,null,null,null,null,null,null,null,null,null,null,null,null,null,null,null,{"$f":"(IF(Summary!I63=\"\",\"\",Summary!I63))","v":""}]
[null,null,null,null,null,null,null,null,null,null,null,null,null,null,null,null,null,null,null,null,null,null,null,null,null,null,null,null,null,null,null,null,null,null,null,null,null,null,null,null,null,null,null,null,null,null,null,null,null,null,null,null,null,null,null,null,null,null,null,null,null,null,null,null,null,null,null,null,null,null,null,null,null,null,null,null,null,null,null,null,null,null,null,null,null,null,null,null,"Number \"False\"",null,null,null,null,null,null,null,null,null,null,null,null,"CANOPY AREAS (SCATTERED TREES)"]
[null,null,null,null,{"$f":"Impact!E12","v":"Date : ???"},null,null,null,null,null,null,null,"REMOVAL","MAJOR PRUNE","MINOR PRUNE","MONITOR",null,null,null,null,null,null,null,null,null,null,null,null,null,null,null,null,null,null,null,null,null,null,null,null,null,null,null,null,null,null,null,null,null,null,null,null,null,null,null,null,null,null,null,null,null,null,null,null,null,null,null,null,null,null,null,null,null,null,null,null,null,null,null,null,null,null,null,null,null,null,null,null,null,null,null,null,null,null,null,null,null,null,null,null,null,null,null,{"$f":"SUM(CZ9:CZ15)","v":0},0,0,0,0,0]
[null,null,null,null,null,null,null,null,null,null,null,null,null,null,null,null,null,null,null,null,null,null,null,null,null,null,null,null,null,null,null,null,null,null,null,null,null,null,null,null,null,null,null,null,null,null,null,null,null,null,null,null,null,null,null,null,null,null,null,null,null,null,null,null,null,null,null,null,null,null,null,null,null,null,null,null,null,null,null,null,null,null,null,null,null,null,null,null,{"$f":"COUNTIF($CK$21:$CK$4913,\"FALSE\")","v":0}]
[]
[null,"Native vegetation removal is required as part of the project described above.\nTree numbers and descriptions are listed as per the attached Vegetation Survey",null,null,null,null,null,null,null,null,null,null,null,null,null,null,null,null,null,null,null,null,null,null,null,null,null,null,null,null,null,null,null,null,null,null,null,null,null,null,null,null,null,null,null,null,null,null,null,null,null,null,null,null,null,null,null,null,null,null,null,null,null,null,null,null,null,null,null,null,null,null,null,null,null,null,null,null,null,null,null,null,null,null,null,null,null,null,null,null,null,null,null,null,null,null,null,null,null,null,null,null,null,null,null,null,null,null,null,"COMMENTS"]
[null,null,null,null,"Totals","Native Veg     Removals",null,null,null,null,null,null,null,null,null,null,null,null,null,null,null,null,null,null,null,null,{"$f":"(SUMIF(BF33:BF34,\"Y\",AA33:AA34)-(SUMIF(R33:R34,\"Y\",AA33:AA34)))","v":0},null,null,null,null,null,null,null,null,null,null,null,null,null,null,null,null,null,null,null,null,null,null,null,null,null,null,null,null,null,null,null,null,{"$f":"SUM(BH33:BH34)","v":0},null,null,null,null,null,null,null,null,null,null,null,null,null,null,null,null,null,null,null,null,null,null,null,null,null,null,null,null,null,null,null,null,null,null,null,null,null,null,null,null,{"$f":"CW35","v":0}]
[null,null,null,null,null,"Major Prune",null,null,null,null,null,null,null,null,null,null,null,null,null,null,null,null,null,null,null,null,{"$f":"(SUMIF(BF36:BF36,\"Y\",AA36:AA36))","v":0},null,null,null,null,null,null,null,null,null,null,null,null,null,null,null,null,null,null,null,null,null,null,null,null,null,null,null,null,null,null,null,null,{"$f":"SUM(BH36:BH36)","v":0}]
[null,null,null,null,"Totals","Environmental Weeds     Removals",null,null,null,null,null,null,null,null,null,null,null,null,null,null,null,null,null,null,null,null,{"$f":"SUM(AB33:AB34)","v":0}]
[null,null,null,null,null,"Major Prune",null,null,null,null,null,null,null,null,null,null,null,null,null,null,null,null,null,null,null,null,{"$f":"SUM(AB36:AB36)","v":0}]
[null,null,null,null,null,"Area",null,null,null,null,null,null,null,null,null,null,null,null,null,null,null,null,null,null,null,null,{"$f":"SUM($AC33:$AC34)","v":0}]
[null,null,null,null,"Totals","Amenity     Removals",null,null,null,null,null,null,null,null,null,null,null,null,null,null,null,null,null,null,null,null,{"$f":"(SUMIF(BD33:BD34,\"Y\",AA33:AA34))","v":0}]
[null,null,null,null,null,"Major Prune",null,null,null,null,null,null,null,null,null,null,null,null,null,null,null,null,null,null,null,null,{"$f":"(SUMIF(BD36:BD36,\"Y\",AA36:AA36))","v":0}]
[null,null,null,null,null,"Area",null,null,null,null,null,null,null,null,null,null,null,null,null,null,null,null,null,null,null,null,{"$f":"(SUMIF($BD33:$BD34,\"Y\",$U33:$U34))","v":0}]
[null,null,null,null,null,"Native veg not covered by Act     Removals",null,null,null,null,null,null,null,null,null,null,null,null,null,null,null,null,null,null,null,null,{"$f":"SUM(AD33:AD34)","v":0}]
[null,null,null,null,"Totals","Major Prune",null,null,null,null,null,null,null,null,null,null,null,null,null,null,null,null,null,null,null,null,{"$f":"SUM(AD36:AD36)","v":0}]
[null,null,null,null,null,"Area",null,null,null,null,null,null,null,null,null,null,null,null,null,null,null,null,null,null,null,null,{"$f":"SUM(BB33:BB34)","v":0}]
[null,null,null,"jjjjj","REMOVALS\n(Areas and Scattered Trees)"]
[null,null,null,null,null,null,null,null,null,null,null,null,null,null,null,null,null,null,null,null,null,{"$f":"IF(BF33=\"\",\"\",(IF(U33=\"\",\"\",(IF(BF33=\"N\",\"\",(IF(BF33=\"Y\",U33)))))))","v":""},null,{"$f":"IF(V33=\"\",\"\",(IF(BF33=\"N\",\"\",((V33*W33)/10000))))","v":""},null,null,null,{"$f":"IF(M33=\"\",0,(IF(T33=\"\",0,(IF(T33=\"Y\",0,(IF(S33=\"Y\",0, (IF(R33=\"Y\",0,(IF(BF33=\"N\",0,(IF(M33=\"P\",AA33)))))))))))))","v":0},{"$f":"IF(N33=\"\",0,(IF(T33=\"\",0,(IF(T33=\"Y\",0,(IF(S33=\"Y\",0, (IF(R33=\"Y\",0,(IF(BF33=\"N\",0,(IF(N33=\"P\",AA33)))))))))))))","v":0},{"$f":"IF(M33=\"\",0,(IF(T33=\"\",0,(IF(T33=\"N\",0,(IF(S33=\"Y\",0,(IF(BF33=\"N\",0,(IF(T33=\"Y\",(X33))))))))))))","v":0},{"$f":"IF(M33=\"\",0,(IF(T33=\"\",0,(IF(T33=\"Y\",0,(IF(S33=\"N\",0,(IF(BF33=\"N\",0,(IF(M33=\"P\",AA33)))))))))))","v":0},{"$f":"IF(N33=\"\",0,(IF(T33=\"\",0,(IF(T33=\"Y\",0,(IF(S33=\"N\",0, (IF(BF33=\"N\",0,(IF(N33=\"P\",AA33)))))))))))","v":0},{"$f":"IF(M33=\"\",0,(IF(T33=\"\",0,(IF(S33=\"N\",0,(IF(BF33=\"N\",0,(IF(T33=\"N\",0,(IF(T33=\"Y\",U33)))))))))))","v":0},{"$f":"IF(M33=\"\",0,(IF(T33=\"\",0,(IF(T33=\"Y\",0,(IF(S33=\"Y\",0,(IF(R33=\"N\",0,(IF(BF33=\"N\",0,(IF(M33=\"P\",AA33)))))))))))))","v":0},{"$f":"IF(N33=\"\",0,(IF(T33=\"\",0,(IF(T33=\"Y\",0,(IF(R33=\"N\",0, (IF(BF33=\"N\",0,(IF(N33=\"P\",AA33)))))))))))","v":0},{"$f":"IF(M33=\"\",0,(IF(BC33=\"N\",0,(IF(BD33=\"Y\",0,(IF(T33=\"Y\",0,(IF(BC33=\"E\",AA33,(IF(BC33=\"D\",AA33,(IF(BC33=\"O\",AA33,(IF(BC33=\"M\",AA33)))))))))))))))","v":0},{"$f":"IF(N33=\"\",0,(IF(BH33>0,0,(IF(BC33=\"N\",0,(IF(BD33=\"Y\",0,(IF(T33=\"Y\",0,(IF(BC33=\"E\",AA33,(IF(BC33=\"D\",AA33,(IF(BC33=\"O\",AA33,(IF(BC33=\"M\",AA33)))))))))))))))))","v":0},{"$f":"IF(M33=\"\",0,(IF(U33=\"\",0,(IF(BC33=\"N\",0,(IF(BD33=\"Y\",0,IF(T33=\"N\",0,(IF(BC33=\"E\",U33,(IF(BC33=\"D\",U33,(IF(BC33=\"O\",U33,(IF(BC33=\"M\",U33))))))))))))))))","v":0},{"$f":"(IF(M33=\"\",0,(IF(AA33=\"\",0,(IF(BE33=\"N\",0,(IF(BF33=\"Y\",0,(IF(R33=\"Y\",0,(IF(BH33>0,0,(IF(T33=\"Y\",0,(IF(BE33=\"Y\",AA33))))))))))))))))","v":0},{"$f":"IF(N33=\"\",0,(IF(AA33=\"\",0,(IF(BE33=\"N\",0,(IF(BF33=\"Y\",0,(IF(BH33>0,0,(IF(R33=\"Y\",0,(IF(T33=\"Y\",0,(IF(BE33=\"Y\",AA33)))))))))))))))","v":0},{"$f":"IF(M33=\"\",0,(IF(U33=\"\",0,(IF(T33=\"N\",0,(IF(BE33=\"N\",0,(IF(BF33=\"Y\",0,(IF(BE33=\"Y\",U33)))))))))))","v":0},{"$f":"IF(M33=\"\",0,(IF(T33=\"\",0,(IF(T33=\"Y\",0,(IF(S33=\"Y\",0,(IF(R33=\"N\",0,(IF(BD33=\"Y\",0,(IF(BF33=\"Y\",0,(IF(M33=\"P\",AA33)))))))))))))))","v":0},{"$f":"IF(N33=\"\",0,(IF(T33=\"\",0,(IF(T33=\"Y\",0,(IF(R33=\"N\",0, (IF(BF33=\"Y\",0,(IF(BE33=\"N\",0,(IF(N33=\"P\",AA33)))))))))))))","v":0},{"$f":"IF(M33=\"\",0,(IF(T33=\"Y\",0,(IF(BG33=\"Y\",0,(IF(BD33=\"N\",0,(IF(R33=\"Y\",0,(IF(BD33=\"Y\",AA33)))))))))))","v":0},{"$f":"IF(N33=\"\",0,(IF(BD33=\"\",0,(IF(BD33=\"N\",0,(IF(BH33>0,0,(IF(T33=\"Y\",0,(IF(R33=\"Y\",0,(IF(BD33=\"Y\",AA33)))))))))))))","v":0},{"$f":"IF(M33=\"\",0,(IF(BD33=\"\",0,(IF(BD33=\"N\",0,(IF(T33=\"N\",0,(IF(Q33=\"Y\",0,(IF(BD33=\"Y\",U33)))))))))))","v":0},{"$f":"IF(M33=\"\",0,(IF(T33=\"\",0,(IF(T33=\"Y\",0,(IF(S33=\"Y\",0,(IF(R33=\"N\",0,(IF(BE33=\"Y\",0,(IF(M33=\"P\",AA33)))))))))))))","v":0},{"$f":"IF(N33=\"\",0,(IF(T33=\"\",0,(IF(T33=\"Y\",0,(IF(R33=\"N\",0, (IF(BE33=\"Y\",0,(IF(BD33=\"N\",0,(IF(N33=\"P\",AA33)))))))))))))","v":0},{"$f":"IF(M33=\"\",0,(IF(BF33=\"Y\",0,(IF(BH33=\"\",0,(IF(BG33=\"N\",0,(IF(BH33=\"R\",0,(IF(BH33=\"S\",AA33)))))))))))","v":0},{"$f":"(IF(AW33=0,0,AW33))*3","v":0},{"$f":"IF(N33=\"\",0,(IF(BF33=\"Y\",0,(IF(BG33=\"N\",0,(IF(BH33=\"R\",0,(IF(BH33=\"S\",AA33)))))))))","v":0},{"$f":"IF(M33=\"\",0,(IF(BF33=\"Y\",0,(IF(BG33=\"N\",0,(IF(BH33=\"\",0,(IF(BH33=\"S\",0,(IF(BH33=\"R\",AA33)))))))))))","v":0},{"$f":"(IF(AZ33=0,0,AZ33))*2","v":0},{"$f":"IF(N33=\"\",0,(IF(BF33=\"Y\",0,(IF(BG33=\"N\",0,(IF(BH33=\"S\",0,(IF(BH33=\"R\",AA33)))))))))","v":0},null,null,null,null,null,null,null,null,null,null,null,null,null,null,null,null,null,null,{"$f":"(IF(BT33=\"\",\"\",((BT33*50)^0.42)*0.64))","v":""},null,null,null,{"$f":"IF(BF33=\"\",\"\",(IF(BF33=\"N\",\"\",(IF(BF33=\"Y\",(IF(BN33=\"\",\"\",(IF($BN33<10,1,(IF($BN33<20,2,3))))*1.05)))))))","v":""},{"$f":"IF(BV33=\"\",\"\",(IF(BF33=\"N\",\"\",(IF(BF33=\"Y\",((100-$BV33)*0.04)+2)))))","v":""},null,{"$f":"IF(CA33=\"\",\"\",(IF(BF33=\"N\",\"\",(IF(BF33=\"Y\",(CA33*1.45))))))","v":""},null,{"$f":"IF(CC33=\"\",\"\",(IF(BF33=\"N\",\"\",(IF(BF33=\"Y\",(CC33*0.65))))))","v":""},null,{"$f":"IF(CE33=\"\",\"\",(IF(BF33=\"N\",\"\",(IF(BF33=\"Y\",(CE33*0.4))))))","v":""},null,{"$f":"IF(CG33=\"\",\"\",(IF(BF33=\"N\",\"\",(IF(BF33=\"Y\",(CG33*0.35))))))","v":""},{"$f":"IF(BY33=\"\",\"\",(SUM(BY33,BZ33,CB33,CD33,CF33,CH33)*SUM(BY33,BZ33,CB33,CD33,CF33,CH33)*SUM(BY33,BZ33,CB33,CD33,CF33,CH33)/55.5))","v":""},{"$f":"IF(CI33=\"\",\"\",IF(CI33<30,0,(IF(CI33>=30,1))))","v":""},{"$f":"IF(CI33=\"\",\"\",(IF(CJ33=1,CJ33=\"@\",(IF(CJ33=0,(IF($CI33<20,4*$CI33/550,(IF($CI33<30,6*$CI33/550,(IF($CI33<41,8*$CI33/550,(IF($CI33<61,10*$CI33/550,12*$CI33/550)))))))))))))","v":""},{"$f":"IF(CI33=\"\",\"\",((IF($CI33<20,4*$CI33/550,(IF($CI33<29.1,6*$CI33/550,(IF($CI33<40.1,8*$CI33/550,(IF($CI33<60.1,10*$CI33/550,12*$CI33/550))))))))*AA33))","v":""},{"$f":"IF(BF33=\"\",\"\",(IF(BF33=\"N\",\"\",(IF(T33=\"Y\",\"Y\",(IF(AA33=\"\",\"Y\",(IF(AA33=0,\"\",(IF(BF33=\"Y\",(AB33+AC33+AE33+AF33+AH33+AI33))))))))))))","v":""},{"$f":"IF(BG33=\"\",\"\",(IF(BG33=\"N\",\"\",(IF(BF33=\"Y\",\"\",(IF(Q33=\"Y\",\"\",(IF(BG33=\"Y\",(AW33+AY33+AZ33+BB33))))))))))","v":""},{"$f":"IF(Q33=\"Y\",\"\",(IF(BF33=\"Y\",\"\",(IF(BG33=\"Y\",\"\",(IF(T33=\"Y\",\"Y\",(IF(AA33=\"\",\"\",(IF(AJ33>0,BI33,(IF(AK33>0,BI33,(AM33+AN33+AR33+AS33+AU33+AV33))))))))))))))","v":""},{"$f":"(IF(AA33=\"\",\"\",(IF(M33=\"\",\"\",(IF(Q33=\"Y\",\"\",(IF(BG33=\"N\",\"\",(IF(BF33=\"Y\",\"\",(IF(BG33=\"Y\",(AX33+BA33)))))))))))))","v":""},{"$f":"IF(AT33=0,\"\",(IF(AQ33=\"Y\",\"\",(AT33))))","v":""},{"$f":"IF(AA33=\"\",\"\",(IF(Q33=\"Y\",\"\",(IF(AR33=0,\"\",(AR33))))))","v":""},{"$f":"IF(AM33=0,\"\",(IF(Q33=\"Y\",\"\",(AM33))))","v":""},{"$f":"IF(AM33=0,\"\",(IF(Q33=\"Y\",\"\",(AM33))))","v":""},{"$f":"(IF(AE33=0,\"\",(IF(Q33=\"Y\",\"\",(AE33*2)))))","v":""},{"$f":"IF(AD33=0,\"\",(IF(Q33=\"Y\",\"\",(AD33))))","v":""},{"$f":"IF(BN33=\"\",\"\",(IF(S33=\"Y\",\"\",(IF(R33=\"Y\",\"\",(IF(Q33=\"Y\",\"\",(IF(T33=\"Y\",\"\",(IF(BF33=\"\",\"\",(IF(BF33=\"N\",\"\",(CL33))))))))))))))","v":""},{"$f":"IF(BF33=\"\",\"\",(IF(BF33=\"N\",\"\",(IF(BP33=\"\",\"\",(IF(R33=\"Y\",\"\",(IF(T33=\"Y\",\"\",(IF($CY$6=\"\",\"\",(IF(AA33=\"\",\"\",(PI()*((BP33/2)*(BP33/2)))/10000*AA33)))))))))))))","v":""}]
[null,null,null,null,null,null,null,null,null,null,null,null,null,null,null,null,null,null,null,null,null,{"$f":"IF(BF34=\"\",\"\",(IF(U34=\"\",\"\",(IF(BF34=\"N\",\"\",(IF(BF34=\"Y\",U34)))))))","v":""},null,{"$f":"IF(V34=\"\",\"\",(IF(BF34=\"N\",\"\",((V34*W34)/10000))))","v":""},null,null,null,{"$f":"IF(M34=\"\",0,(IF(T34=\"\",0,(IF(T34=\"Y\",0,(IF(S34=\"Y\",0, (IF(R34=\"Y\",0,(IF(BF34=\"N\",0,(IF(M34=\"P\",AA34)))))))))))))","v":0},{"$f":"IF(N34=\"\",0,(IF(T34=\"\",0,(IF(T34=\"Y\",0,(IF(S34=\"Y\",0, (IF(R34=\"Y\",0,(IF(BF34=\"N\",0,(IF(N34=\"P\",AA34)))))))))))))","v":0},{"$f":"IF(M34=\"\",0,(IF(T34=\"\",0,(IF(T34=\"N\",0,(IF(S34=\"Y\",0,(IF(BF34=\"N\",0,(IF(T34=\"Y\",(X34))))))))))))","v":0},{"$f":"IF(M34=\"\",0,(IF(T34=\"\",0,(IF(T34=\"Y\",0,(IF(S34=\"N\",0,(IF(BF34=\"N\",0,(IF(M34=\"P\",AA34)))))))))))","v":0},{"$f":"IF(N34=\"\",0,(IF(T34=\"\",0,(IF(T34=\"Y\",0,(IF(S34=\"N\",0, (IF(BF34=\"N\",0,(IF(N34=\"P\",AA34)))))))))))","v":0},{"$f":"IF(M34=\"\",0,(IF(T34=\"\",0,(IF(S34=\"N\",0,(IF(BF34=\"N\",0,(IF(T34=\"N\",0,(IF(T34=\"Y\",U34)))))))))))","v":0},{"$f":"IF(M34=\"\",0,(IF(T34=\"\",0,(IF(T34=\"Y\",0,(IF(S34=\"Y\",0,(IF(R34=\"N\",0,(IF(BF34=\"N\",0,(IF(M34=\"P\",AA34)))))))))))))","v":0},{"$f":"IF(N34=\"\",0,(IF(T34=\"\",0,(IF(T34=\"Y\",0,(IF(R34=\"N\",0, (IF(BF34=\"N\",0,(IF(N34=\"P\",AA34)))))))))))","v":0},{"$f":"IF(M34=\"\",0,(IF(BC34=\"N\",0,(IF(BD34=\"Y\",0,(IF(T34=\"Y\",0,(IF(BC34=\"E\",AA34,(IF(BC34=\"D\",AA34,(IF(BC34=\"O\",AA34,(IF(BC34=\"M\",AA34)))))))))))))))","v":0},{"$f":"IF(N34=\"\",0,(IF(BH34>0,0,(IF(BC34=\"N\",0,(IF(BD34=\"Y\",0,(IF(T34=\"Y\",0,(IF(BC34=\"E\",AA34,(IF(BC34=\"D\",AA34,(IF(BC34=\"O\",AA34,(IF(BC34=\"M\",AA34)))))))))))))))))","v":0},{"$f":"IF(M34=\"\",0,(IF(U34=\"\",0,(IF(BC34=\"N\",0,(IF(BD34=\"Y\",0,IF(T34=\"N\",0,(IF(BC34=\"E\",U34,(IF(BC34=\"D\",U34,(IF(BC34=\"O\",U34,(IF(BC34=\"M\",U34))))))))))))))))","v":0},{"$f":"(IF(M34=\"\",0,(IF(AA34=\"\",0,(IF(BE34=\"N\",0,(IF(BF34=\"Y\",0,(IF(R34=\"Y\",0,(IF(BH34>0,0,(IF(T34=\"Y\",0,(IF(BE34=\"Y\",AA34))))))))))))))))","v":0},{"$f":"IF(N34=\"\",0,(IF(AA34=\"\",0,(IF(BE34=\"N\",0,(IF(BF34=\"Y\",0,(IF(BH34>0,0,(IF(R34=\"Y\",0,(IF(T34=\"Y\",0,(IF(BE34=\"Y\",AA34)))))))))))))))","v":0},{"$f":"IF(M34=\"\",0,(IF(U34=\"\",0,(IF(T34=\"N\",0,(IF(BE34=\"N\",0,(IF(BF34=\"Y\",0,(IF(BE34=\"Y\",U34)))))))))))","v":0},{"$f":"IF(M34=\"\",0,(IF(T34=\"\",0,(IF(T34=\"Y\",0,(IF(S34=\"Y\",0,(IF(R34=\"N\",0,(IF(BD34=\"Y\",0,(IF(BF34=\"Y\",0,(IF(M34=\"P\",AA34)))))))))))))))","v":0},{"$f":"IF(N34=\"\",0,(IF(T34=\"\",0,(IF(T34=\"Y\",0,(IF(R34=\"N\",0, (IF(BF34=\"Y\",0,(IF(BE34=\"N\",0,(IF(N34=\"P\",AA34)))))))))))))","v":0},{"$f":"IF(M34=\"\",0,(IF(T34=\"Y\",0,(IF(BG34=\"Y\",0,(IF(BD34=\"N\",0,(IF(R34=\"Y\",0,(IF(BD34=\"Y\",AA34)))))))))))","v":0},{"$f":"IF(N34=\"\",0,(IF(BD34=\"\",0,(IF(BD34=\"N\",0,(IF(BH34>0,0,(IF(T34=\"Y\",0,(IF(R34=\"Y\",0,(IF(BD34=\"Y\",AA34)))))))))))))","v":0},{"$f":"IF(M34=\"\",0,(IF(BD34=\"\",0,(IF(BD34=\"N\",0,(IF(T34=\"N\",0,(IF(Q34=\"Y\",0,(IF(BD34=\"Y\",U34)))))))))))","v":0},{"$f":"IF(M34=\"\",0,(IF(T34=\"\",0,(IF(T34=\"Y\",0,(IF(S34=\"Y\",0,(IF(R34=\"N\",0,(IF(BE34=\"Y\",0,(IF(M34=\"P\",AA34)))))))))))))","v":0},{"$f":"IF(N34=\"\",0,(IF(T34=\"\",0,(IF(T34=\"Y\",0,(IF(R34=\"N\",0, (IF(BE34=\"Y\",0,(IF(BD34=\"N\",0,(IF(N34=\"P\",AA34)))))))))))))","v":0},{"$f":"IF(M34=\"\",0,(IF(BF34=\"Y\",0,(IF(BH34=\"\",0,(IF(BG34=\"N\",0,(IF(BH34=\"R\",0,(IF(BH34=\"S\",AA34)))))))))))","v":0},0,{"$f":"IF(N34=\"\",0,(IF(BF34=\"Y\",0,(IF(BG34=\"N\",0,(IF(BH34=\"R\",0,(IF(BH34=\"S\",AA34)))))))))","v":0},{"$f":"IF(M34=\"\",0,(IF(BF34=\"Y\",0,(IF(BG34=\"N\",0,(IF(BH34=\"\",0,(IF(BH34=\"S\",0,(IF(BH34=\"R\",AA34)))))))))))","v":0},0,{"$f":"IF(N34=\"\",0,(IF(BF34=\"Y\",0,(IF(BG34=\"N\",0,(IF(BH34=\"S\",0,(IF(BH34=\"R\",AA34)))))))))","v":0},null,null,null,null,null,null,null,null,null,null,null,null,null,null,null,null,null,null,"",null,null,null,"","",null,"",null,"",null,"",null,"","","","",{"$f":"IF(CI34=\"\",\"\",((IF($CI34<20,4*$CI34/550,(IF($CI34<29.1,6*$CI34/550,(IF($CI34<40.1,8*$CI34/550,(IF($CI34<60.1,10*$CI34/550,12*$CI34/550))))))))*AA34))","v":""},{"$f":"IF(BF34=\"\",\"\",(IF(BF34=\"N\",\"\",(IF(T34=\"Y\",\"Y\",(IF(AA34=\"\",\"Y\",(IF(AA34=0,\"\",(IF(BF34=\"Y\",(AB34+AC34+AE34+AF34+AH34+AI34))))))))))))","v":""},{"$f":"IF(BG34=\"\",\"\",(IF(BG34=\"N\",\"\",(IF(BF34=\"Y\",\"\",(IF(Q34=\"Y\",\"\",(IF(BG34=\"Y\",(AW34+AY34+AZ34+BB34))))))))))","v":""},{"$f":"IF(Q34=\"Y\",\"\",(IF(BF34=\"Y\",\"\",(IF(BG34=\"Y\",\"\",(IF(T34=\"Y\",\"Y\",(IF(AA34=\"\",\"\",(IF(AJ34>0,BI34,(IF(AK34>0,BI34,(AM34+AN34+AR34+AS34+AU34+AV34))))))))))))))","v":""},{"$f":"(IF(AA34=\"\",\"\",(IF(M34=\"\",\"\",(IF(Q34=\"Y\",\"\",(IF(BG34=\"N\",\"\",(IF(BF34=\"Y\",\"\",(IF(BG34=\"Y\",(AX34+BA34)))))))))))))","v":""},"",{"$f":"IF(AA34=\"\",\"\",(IF(Q34=\"Y\",\"\",(IF(AR34=0,\"\",(AR34))))))","v":""},"","","","",{"$f":"IF(BN34=\"\",\"\",(IF(S34=\"Y\",\"\",(IF(R34=\"Y\",\"\",(IF(Q34=\"Y\",\"\",(IF(T34=\"Y\",\"\",(IF(BF34=\"\",\"\",(IF(BF34=\"N\",\"\",(CL34))))))))))))))","v":""},{"$f":"IF(BF34=\"\",\"\",(IF(BF34=\"N\",\"\",(IF(BP34=\"\",\"\",(IF(R34=\"Y\",\"\",(IF(T34=\"Y\",\"\",(IF($CY$6=\"\",\"\",(IF(AA34=\"\",\"\",(PI()*((BP34/2)*(BP34/2)))/10000*AA34)))))))))))))","v":""}]
[null,null,null,"yyyyy","MAJOR PRUNING\n(Scattered Trees Only)"]
[null,null,null,null,null,null,null,null,null,null,null,null,null,null,null,null,null,null,null,null,null,{"$f":"IF(BF36=\"\",\"\",(IF(U36=\"\",\"\",(IF(BF36=\"N\",\"\",(IF(BF36=\"Y\",U36)))))))","v":""},null,{"$f":"IF(V36=\"\",\"\",(IF(BF36=\"N\",\"\",((V36*W36)/10000))))","v":""},null,null,null,{"$f":"IF(M36=\"\",0,(IF(T36=\"\",0,(IF(T36=\"Y\",0,(IF(S36=\"Y\",0, (IF(R36=\"Y\",0,(IF(BF36=\"N\",0,(IF(M36=\"P\",AA36)))))))))))))","v":0},{"$f":"IF(N36=\"\",0,(IF(T36=\"\",0,(IF(T36=\"Y\",0,(IF(S36=\"Y\",0, (IF(R36=\"Y\",0,(IF(BF36=\"N\",0,(IF(N36=\"P\",AA36)))))))))))))","v":0},{"$f":"IF(M36=\"\",0,(IF(T36=\"\",0,(IF(T36=\"N\",0,(IF(S36=\"Y\",0,(IF(BF36=\"N\",0,(IF(T36=\"Y\",(X36))))))))))))","v":0},{"$f":"IF(M36=\"\",0,(IF(T36=\"\",0,(IF(T36=\"Y\",0,(IF(S36=\"N\",0,(IF(BF36=\"N\",0,(IF(M36=\"P\",AA36)))))))))))","v":0},{"$f":"IF(N36=\"\",0,(IF(T36=\"\",0,(IF(T36=\"Y\",0,(IF(S36=\"N\",0, (IF(BF36=\"N\",0,(IF(N36=\"P\",AA36)))))))))))","v":0},{"$f":"IF(M36=\"\",0,(IF(T36=\"\",0,(IF(S36=\"N\",0,(IF(BF36=\"N\",0,(IF(T36=\"N\",0,(IF(T36=\"Y\",U36)))))))))))","v":0},{"$f":"IF(M36=\"\",0,(IF(T36=\"\",0,(IF(T36=\"Y\",0,(IF(S36=\"Y\",0,(IF(R36=\"N\",0,(IF(BF36=\"N\",0,(IF(M36=\"P\",AA36)))))))))))))","v":0},{"$f":"IF(N36=\"\",0,(IF(T36=\"\",0,(IF(T36=\"Y\",0,(IF(R36=\"N\",0, (IF(BF36=\"N\",0,(IF(N36=\"P\",AA36)))))))))))","v":0},{"$f":"IF(M36=\"\",0,(IF(BC36=\"N\",0,(IF(BD36=\"Y\",0,(IF(T36=\"Y\",0,(IF(BC36=\"E\",AA36,(IF(BC36=\"D\",AA36,(IF(BC36=\"O\",AA36,(IF(BC36=\"M\",AA36)))))))))))))))","v":0},{"$f":"IF(N36=\"\",0,(IF(BH36>0,0,(IF(BC36=\"N\",0,(IF(BD36=\"Y\",0,(IF(T36=\"Y\",0,(IF(BC36=\"E\",AA36,(IF(BC36=\"D\",AA36,(IF(BC36=\"O\",AA36,(IF(BC36=\"M\",AA36)))))))))))))))))","v":0},{"$f":"IF(M36=\"\",0,(IF(U36=\"\",0,(IF(BC36=\"N\",0,(IF(BD36=\"Y\",0,IF(T36=\"N\",0,(IF(BC36=\"E\",U36,(IF(BC36=\"D\",U36,(IF(BC36=\"O\",U36,(IF(BC36=\"M\",U36))))))))))))))))","v":0},{"$f":"(IF(M36=\"\",0,(IF(AA36=\"\",0,(IF(BE36=\"N\",0,(IF(BF36=\"Y\",0,(IF(R36=\"Y\",0,(IF(BH36>0,0,(IF(T36=\"Y\",0,(IF(BE36=\"Y\",AA36))))))))))))))))","v":0},{"$f":"IF(N36=\"\",0,(IF(AA36=\"\",0,(IF(BE36=\"N\",0,(IF(BF36=\"Y\",0,(IF(BH36>0,0,(IF(R36=\"Y\",0,(IF(T36=\"Y\",0,(IF(BE36=\"Y\",AA36)))))))))))))))","v":0},{"$f":"IF(M36=\"\",0,(IF(U36=\"\",0,(IF(T36=\"N\",0,(IF(BE36=\"N\",0,(IF(BF36=\"Y\",0,(IF(BE36=\"Y\",U36)))))))))))","v":0},{"$f":"IF(M36=\"\",0,(IF(T36=\"\",0,(IF(T36=\"Y\",0,(IF(S36=\"Y\",0,(IF(R36=\"N\",0,(IF(BD36=\"Y\",0,(IF(BF36=\"Y\",0,(IF(M36=\"P\",AA36)))))))))))))))","v":0},{"$f":"IF(N36=\"\",0,(IF(T36=\"\",0,(IF(T36=\"Y\",0,(IF(R36=\"N\",0, (IF(BF36=\"Y\",0,(IF(BE36=\"N\",0,(IF(N36=\"P\",AA36)))))))))))))","v":0},{"$f":"IF(M36=\"\",0,(IF(T36=\"Y\",0,(IF(BG36=\"Y\",0,(IF(BD36=\"N\",0,(IF(R36=\"Y\",0,(IF(BD36=\"Y\",AA36)))))))))))","v":0},{"$f":"IF(N36=\"\",0,(IF(BD36=\"\",0,(IF(BD36=\"N\",0,(IF(BH36>0,0,(IF(T36=\"Y\",0,(IF(R36=\"Y\",0,(IF(BD36=\"Y\",AA36)))))))))))))","v":0},{"$f":"IF(M36=\"\",0,(IF(BD36=\"\",0,(IF(BD36=\"N\",0,(IF(T36=\"N\",0,(IF(Q36=\"Y\",0,(IF(BD36=\"Y\",U36)))))))))))","v":0},{"$f":"IF(M36=\"\",0,(IF(T36=\"\",0,(IF(T36=\"Y\",0,(IF(S36=\"Y\",0,(IF(R36=\"N\",0,(IF(BE36=\"Y\",0,(IF(M36=\"P\",AA36)))))))))))))","v":0},{"$f":"IF(N36=\"\",0,(IF(T36=\"\",0,(IF(T36=\"Y\",0,(IF(R36=\"N\",0, (IF(BE36=\"Y\",0,(IF(BD36=\"N\",0,(IF(N36=\"P\",AA36)))))))))))))","v":0},{"$f":"IF(M36=\"\",0,(IF(BF36=\"Y\",0,(IF(BH36=\"\",0,(IF(BG36=\"N\",0,(IF(BH36=\"R\",0,(IF(BH36=\"S\",AA36)))))))))))","v":0},{"$f":"(IF(AW36=0,0,AW36))*3","v":0},{"$f":"IF(N36=\"\",0,(IF(BF36=\"Y\",0,(IF(BG36=\"N\",0,(IF(BH36=\"R\",0,(IF(BH36=\"S\",AA36)))))))))","v":0},{"$f":"IF(M36=\"\",0,(IF(BF36=\"Y\",0,(IF(BG36=\"N\",0,(IF(BH36=\"\",0,(IF(BH36=\"S\",0,(IF(BH36=\"R\",AA36)))))))))))","v":0},{"$f":"(IF(AZ36=0,0,AZ36))*2","v":0},{"$f":"IF(N36=\"\",0,(IF(BF36=\"Y\",0,(IF(BG36=\"N\",0,(IF(BH36=\"S\",0,(IF(BH36=\"R\",AA36)))))))))","v":0},null,null,null,null,null,null,null,null,null,null,null,null,null,null,null,null,null,null,{"$f":"(IF(BT36=\"\",\"\",((BT36*50)^0.42)*0.64))","v":""},null,null,null,{"$f":"IF(BF36=\"\",\"\",(IF(BF36=\"N\",\"\",(IF(BF36=\"Y\",(IF(BN36=\"\",\"\",(IF($BN36<10,1,(IF($BN36<20,2,3))))*1.05)))))))","v":""},{"$f":"IF(BV36=\"\",\"\",(IF(BF36=\"N\",\"\",(IF(BF36=\"Y\",((100-$BV36)*0.04)+2)))))","v":""},null,{"$f":"IF(CA36=\"\",\"\",(IF(BF36=\"N\",\"\",(IF(BF36=\"Y\",(CA36*1.45))))))","v":""},null,{"$f":"IF(CC36=\"\",\"\",(IF(BF36=\"N\",\"\",(IF(BF36=\"Y\",(CC36*0.65))))))","v":""},null,{"$f":"IF(CE36=\"\",\"\",(IF(BF36=\"N\",\"\",(IF(BF36=\"Y\",(CE36*0.4))))))","v":""},null,{"$f":"IF(CG36=\"\",\"\",(IF(BF36=\"N\",\"\",(IF(BF36=\"Y\",(CG36*0.35))))))","v":""},{"$f":"IF(BY36=\"\",\"\",(SUM(BY36,BZ36,CB36,CD36,CF36,CH36)*SUM(BY36,BZ36,CB36,CD36,CF36,CH36)*SUM(BY36,BZ36,CB36,CD36,CF36,CH36)/55.5))","v":""},{"$f":"IF(CI36=\"\",\"\",IF(CI36<30,0,(IF(CI36>=30,1))))","v":""},{"$f":"IF(CI36=\"\",\"\",(IF(CJ36=1,CJ36=\"@\",(IF(CJ36=0,(IF($CI36<20,4*$CI36/550,(IF($CI36<30,6*$CI36/550,(IF($CI36<41,8*$CI36/550,(IF($CI36<61,10*$CI36/550,12*$CI36/550)))))))))))))","v":""},{"$f":"IF(CI36=\"\",\"\",((IF($CI36<20,4*$CI36/550,(IF($CI36<29.1,6*$CI36/550,(IF($CI36<40.1,8*$CI36/550,(IF($CI36<60.1,10*$CI36/550,12*$CI36/550))))))))*AA36))","v":""},{"$f":"IF(BF36=\"\",\"\",(IF(BF36=\"N\",\"\",(IF(T36=\"Y\",\"Y\",(IF(AA36=\"\",\"Y\",(IF(AA36=0,\"\",(IF(BF36=\"Y\",(AB36+AC36+AE36+AF36+AH36+AI36))))))))))))","v":""},{"$f":"IF(BG36=\"\",\"\",(IF(BG36=\"N\",\"\",(IF(BF36=\"Y\",\"\",(IF(Q36=\"Y\",\"\",(IF(BG36=\"Y\",(AW36+AY36+AZ36+BB36))))))))))","v":""},{"$f":"IF(Q36=\"Y\",\"\",(IF(BF36=\"Y\",\"\",(IF(BG36=\"Y\",\"\",(IF(T36=\"Y\",\"Y\",(IF(AA36=\"\",\"\",(IF(AJ36>0,BI36,(IF(AK36>0,BI36,(AM36+AN36+AR36+AS36+AU36+AV36))))))))))))))","v":""},{"$f":"(IF(AA36=\"\",\"\",(IF(M36=\"\",\"\",(IF(Q36=\"Y\",\"\",(IF(BG36=\"N\",\"\",(IF(BF36=\"Y\",\"\",(IF(BG36=\"Y\",(AX36+BA36)))))))))))))","v":""},{"$f":"IF(AT36=0,\"\",(IF(AQ36=\"Y\",\"\",(AT36))))","v":""},{"$f":"IF(AA36=\"\",\"\",(IF(Q36=\"Y\",\"\",(IF(AR36=0,\"\",(AR36))))))","v":""},{"$f":"IF(AM36=0,\"\",(IF(Q36=\"Y\",\"\",(AM36))))","v":""},{"$f":"IF(AM36=0,\"\",(IF(Q36=\"Y\",\"\",(AM36))))","v":""},{"$f":"(IF(AE36=0,\"\",(IF(Q36=\"Y\",\"\",(AE36*2)))))","v":""},{"$f":"IF(AD36=0,\"\",(IF(Q36=\"Y\",\"\",(AD36))))","v":""},{"$f":"IF(BN36=\"\",\"\",(IF(S36=\"Y\",\"\",(IF(R36=\"Y\",\"\",(IF(Q36=\"Y\",\"\",(IF(T36=\"Y\",\"\",(IF(BF36=\"\",\"\",(IF(BF36=\"N\",\"\",(CL36))))))))))))))","v":""},{"$f":"IF(BF36=\"\",\"\",(IF(BF36=\"N\",\"\",(IF(BP36=\"\",\"\",(IF(R36=\"Y\",\"\",(IF(T36=\"Y\",\"\",(IF($CY$6=\"\",\"\",(IF(AA36=\"\",\"\",(PI()*((BP36/2)*(BP36/2)))/10000*AA36)))))))))))))","v":""}]
[null,null,null,null,null,null,null,null,null,null,null,null,null,null,null,null,null,null,null,null,null,{"$f":"IF(BF37=\"\",\"\",(IF(U37=\"\",\"\",(IF(BF37=\"N\",\"\",(IF(BF37=\"Y\",U37)))))))","v":""},null,{"$f":"IF(V37=\"\",\"\",(IF(BF37=\"N\",\"\",((V37*W37)/10000))))","v":""},null,null,null,{"$f":"IF(M37=\"\",0,(IF(T37=\"\",0,(IF(T37=\"Y\",0,(IF(S37=\"Y\",0, (IF(R37=\"Y\",0,(IF(BF37=\"N\",0,(IF(M37=\"P\",AA37)))))))))))))","v":0},{"$f":"IF(N37=\"\",0,(IF(T37=\"\",0,(IF(T37=\"Y\",0,(IF(S37=\"Y\",0, (IF(R37=\"Y\",0,(IF(BF37=\"N\",0,(IF(N37=\"P\",AA37)))))))))))))","v":0},{"$f":"IF(M37=\"\",0,(IF(T37=\"\",0,(IF(T37=\"N\",0,(IF(S37=\"Y\",0,(IF(BF37=\"N\",0,(IF(T37=\"Y\",(X37))))))))))))","v":0},{"$f":"IF(M37=\"\",0,(IF(T37=\"\",0,(IF(T37=\"Y\",0,(IF(S37=\"N\",0,(IF(BF37=\"N\",0,(IF(M37=\"P\",AA37)))))))))))","v":0},{"$f":"IF(N37=\"\",0,(IF(T37=\"\",0,(IF(T37=\"Y\",0,(IF(S37=\"N\",0, (IF(BF37=\"N\",0,(IF(N37=\"P\",AA37)))))))))))","v":0},{"$f":"IF(M37=\"\",0,(IF(T37=\"\",0,(IF(S37=\"N\",0,(IF(BF37=\"N\",0,(IF(T37=\"N\",0,(IF(T37=\"Y\",U37)))))))))))","v":0},{"$f":"IF(M37=\"\",0,(IF(T37=\"\",0,(IF(T37=\"Y\",0,(IF(S37=\"Y\",0,(IF(R37=\"N\",0,(IF(BF37=\"N\",0,(IF(M37=\"P\",AA37)))))))))))))","v":0},{"$f":"IF(N37=\"\",0,(IF(T37=\"\",0,(IF(T37=\"Y\",0,(IF(R37=\"N\",0, (IF(BF37=\"N\",0,(IF(N37=\"P\",AA37)))))))))))","v":0},{"$f":"IF(M37=\"\",0,(IF(BC37=\"N\",0,(IF(BD37=\"Y\",0,(IF(T37=\"Y\",0,(IF(BC37=\"E\",AA37,(IF(BC37=\"D\",AA37,(IF(BC37=\"O\",AA37,(IF(BC37=\"M\",AA37)))))))))))))))","v":0},{"$f":"IF(N37=\"\",0,(IF(BH37>0,0,(IF(BC37=\"N\",0,(IF(BD37=\"Y\",0,(IF(T37=\"Y\",0,(IF(BC37=\"E\",AA37,(IF(BC37=\"D\",AA37,(IF(BC37=\"O\",AA37,(IF(BC37=\"M\",AA37)))))))))))))))))","v":0},{"$f":"IF(M37=\"\",0,(IF(U37=\"\",0,(IF(BC37=\"N\",0,(IF(BD37=\"Y\",0,IF(T37=\"N\",0,(IF(BC37=\"E\",U37,(IF(BC37=\"D\",U37,(IF(BC37=\"O\",U37,(IF(BC37=\"M\",U37))))))))))))))))","v":0},{"$f":"(IF(M37=\"\",0,(IF(AA37=\"\",0,(IF(BE37=\"N\",0,(IF(BF37=\"Y\",0,(IF(R37=\"Y\",0,(IF(BH37>0,0,(IF(T37=\"Y\",0,(IF(BE37=\"Y\",AA37))))))))))))))))","v":0},{"$f":"IF(N37=\"\",0,(IF(AA37=\"\",0,(IF(BE37=\"N\",0,(IF(BF37=\"Y\",0,(IF(BH37>0,0,(IF(R37=\"Y\",0,(IF(T37=\"Y\",0,(IF(BE37=\"Y\",AA37)))))))))))))))","v":0},{"$f":"IF(M37=\"\",0,(IF(U37=\"\",0,(IF(T37=\"N\",0,(IF(BE37=\"N\",0,(IF(BF37=\"Y\",0,(IF(BE37=\"Y\",U37)))))))))))","v":0},{"$f":"IF(M37=\"\",0,(IF(T37=\"\",0,(IF(T37=\"Y\",0,(IF(S37=\"Y\",0,(IF(R37=\"N\",0,(IF(BD37=\"Y\",0,(IF(BF37=\"Y\",0,(IF(M37=\"P\",AA37)))))))))))))))","v":0},{"$f":"IF(N37=\"\",0,(IF(T37=\"\",0,(IF(T37=\"Y\",0,(IF(R37=\"N\",0, (IF(BF37=\"Y\",0,(IF(BE37=\"N\",0,(IF(N37=\"P\",AA37)))))))))))))","v":0},{"$f":"IF(M37=\"\",0,(IF(T37=\"Y\",0,(IF(BG37=\"Y\",0,(IF(BD37=\"N\",0,(IF(R37=\"Y\",0,(IF(BD37=\"Y\",AA37)))))))))))","v":0},{"$f":"IF(N37=\"\",0,(IF(BD37=\"\",0,(IF(BD37=\"N\",0,(IF(BH37>0,0,(IF(T37=\"Y\",0,(IF(R37=\"Y\",0,(IF(BD37=\"Y\",AA37)))))))))))))","v":0},{"$f":"IF(M37=\"\",0,(IF(BD37=\"\",0,(IF(BD37=\"N\",0,(IF(T37=\"N\",0,(IF(Q37=\"Y\",0,(IF(BD37=\"Y\",U37)))))))))))","v":0},{"$f":"IF(M37=\"\",0,(IF(T37=\"\",0,(IF(T37=\"Y\",0,(IF(S37=\"Y\",0,(IF(R37=\"N\",0,(IF(BE37=\"Y\",0,(IF(M37=\"P\",AA37)))))))))))))","v":0},{"$f":"IF(N37=\"\",0,(IF(T37=\"\",0,(IF(T37=\"Y\",0,(IF(R37=\"N\",0, (IF(BE37=\"Y\",0,(IF(BD37=\"N\",0,(IF(N37=\"P\",AA37)))))))))))))","v":0},{"$f":"IF(M37=\"\",0,(IF(BF37=\"Y\",0,(IF(BH37=\"\",0,(IF(BG37=\"N\",0,(IF(BH37=\"R\",0,(IF(BH37=\"S\",AA37)))))))))))","v":0},0,{"$f":"IF(N37=\"\",0,(IF(BF37=\"Y\",0,(IF(BG37=\"N\",0,(IF(BH37=\"R\",0,(IF(BH37=\"S\",AA37)))))))))","v":0},{"$f":"IF(M37=\"\",0,(IF(BF37=\"Y\",0,(IF(BG37=\"N\",0,(IF(BH37=\"\",0,(IF(BH37=\"S\",0,(IF(BH37=\"R\",AA37)))))))))))","v":0},0,{"$f":"IF(N37=\"\",0,(IF(BF37=\"Y\",0,(IF(BG37=\"N\",0,(IF(BH37=\"S\",0,(IF(BH37=\"R\",AA37)))))))))","v":0},null,null,null,null,null,null,null,null,null,null,null,null,null,null,null,null,null,null,"",null,null,null,"","",null,"",null,"",null,"",null,"","","","",{"$f":"IF(CI37=\"\",\"\",((IF($CI37<20,4*$CI37/550,(IF($CI37<29.1,6*$CI37/550,(IF($CI37<40.1,8*$CI37/550,(IF($CI37<60.1,10*$CI37/550,12*$CI37/550))))))))*AA37))","v":""},{"$f":"IF(BF37=\"\",\"\",(IF(BF37=\"N\",\"\",(IF(T37=\"Y\",\"Y\",(IF(AA37=\"\",\"Y\",(IF(AA37=0,\"\",(IF(BF37=\"Y\",(AB37+AC37+AE37+AF37+AH37+AI37))))))))))))","v":""},{"$f":"IF(BG37=\"\",\"\",(IF(BG37=\"N\",\"\",(IF(BF37=\"Y\",\"\",(IF(Q37=\"Y\",\"\",(IF(BG37=\"Y\",(AW37+AY37+AZ37+BB37))))))))))","v":""},{"$f":"IF(Q37=\"Y\",\"\",(IF(BF37=\"Y\",\"\",(IF(BG37=\"Y\",\"\",(IF(T37=\"Y\",\"Y\",(IF(AA37=\"\",\"\",(IF(AJ37>0,BI37,(IF(AK37>0,BI37,(AM37+AN37+AR37+AS37+AU37+AV37))))))))))))))","v":""},{"$f":"(IF(AA37=\"\",\"\",(IF(M37=\"\",\"\",(IF(Q37=\"Y\",\"\",(IF(BG37=\"N\",\"\",(IF(BF37=\"Y\",\"\",(IF(BG37=\"Y\",(AX37+BA37)))))))))))))","v":""},"",{"$f":"IF(AA37=\"\",\"\",(IF(Q37=\"Y\",\"\",(IF(AR37=0,\"\",(AR37))))))","v":""},"","","","",{"$f":"IF(BN37=\"\",\"\",(IF(S37=\"Y\",\"\",(IF(R37=\"Y\",\"\",(IF(Q37=\"Y\",\"\",(IF(T37=\"Y\",\"\",(IF(BF37=\"\",\"\",(IF(BF37=\"N\",\"\",(CL37))))))))))))))","v":""},{"$f":"IF(BF37=\"\",\"\",(IF(BF37=\"N\",\"\",(IF(BP37=\"\",\"\",(IF(R37=\"Y\",\"\",(IF(T37=\"Y\",\"\",(IF($CY$6=\"\",\"\",(IF(AA37=\"\",\"\",(PI()*((BP37/2)*(BP37/2)))/10000*AA37)))))))))))))","v":""}]
[null,null,null,"qqqqq"]

{"sheet":"Native Veg Summary","index":7,"n_rows":19,"n_cols":37,"rows_kept":19,"cut":false,"hidden":false,"merged":[[4,36,4,50],[0,0,0,16],[0,17,1,29],[1,0,1,16],[2,0,3,11],[2,12,3,16],[2,17,2,29],[3,17,3,29],[4,0,4,11],[4,12,4,23],[4,24,4,29],[5,0,5,3],[5,4,5,7],[5,8,5,11],[5,12,5,15],[5,16,5,19],[5,20,5,23],[5,24,5,26],[5,27,5,29],[6,20,6,23],[6,24,7,26],[6,27,7,29],[7,0,7,3],[7,4,7,7],[7,8,7,11],[7,12,7,15],[7,16,7,19],[7,20,7,23],[6,0,6,3],[6,4,6,7],[6,8,6,11],[6,12,6,15],[6,16,6,19],[8,20,9,23],[8,24,9,26],[8,27,9,29],[9,0,9,7],[9,8,9,11],[8,0,8,3],[8,4,8,7],[8,8,8,11],[8,12,9,15],[8,16,9,19],[10,27,11,29],[11,0,11,3],[11,4,11,11],[11,12,11,15],[11,16,11,23],[10,0,10,2],[10,4,10,11],[10,12,10,14],[10,16,10,23],[10,24,11,26],[18,0,18,2],[18,3,18,29],[14,18,14,23],[14,24,14,29],[15,0,16,11],[15,12,15,17],[15,18,15,23],[15,24,15,29],[16,12,16,17],[16,18,16,23],[16,24,16,29],[13,0,14,11],[13,12,13,17],[13,18,13,23],[13,24,13,29],[14,12,14,17]]}
["DEPARTMENT OF PLANNING TRANSPORT & INFRASTRUCTURE",null,null,null,null,null,null,null,null,null,null,null,null,null,null,null,null,{"$f":"Main!$F$2","v":"Project Name: "}]
[{"$f":"Main!A3","v":"SAFETY & SERVICE DIVISION            Revision - August 2018"},null,null,null,null,null,null,null,null,null,null,null,null,null,null,null,null,{"$f":"Main!$F$4","v":"Location :"}]
["Native Vegetation Impact Summary\nNative Vegetation Act, 1991",null,null,null,null,null,null,null,null,null,null,null,{"$f":"Main!E4","v":"VS 2017/???"},null,null,null,null,{"$f":"Main!$F$3","v":"Road Number : "}]
[null,null,null,null,null,null,null,null,null,null,null,null,null,null,null,null,null,{"$f":"Main!$F$4","v":"Location :"}]
["CLEARANCE",null,null,null,null,null,null,null,null,null,null,null,"CLEARANCE UNDER REGULATION 5(1)(lb)",null,null,null,null,null,null,null,null,null,null,null,"CLEARANCE OF:\nStructurally Unsound Vegetation AND/OR Vegetation within the Clearance Envelope.\nNo Off-set is Required",null,null,null,null,null,null,null,null,null,null,null,"Superseded/repealed from 1 November 2021 – refer to https://www.dit.sa.gov.au/standards/environment"]
["IMPACT",null,null,null,"Number/Ha",null,null,null,"SEB (Ha)",null,null,null,"IMPACT",null,null,null,"Number/Ha",null,null,null,"OFFSET (Ha/Number)\n(DPTI Self Imposed Offset)",null,null,null,"IMPACT",null,null,"Number/Ha"]
["REMOVAL (number)",null,null,null,{"$f":"Impact!AA17","v":0},null,null,null,{"$f":"Impact!CW29","v":0},null,null,null,"REMOVAL (number)",null,null,null,{"$f":"Impact!AF17","v":0},null,null,null,{"$f":"(IF(Q7=\"\",\"\",Q7*2))","v":0},null,null,null,"Number to be Removed",null,null,{"$f":"Impact!AH17","v":0}]
["MAJOR PRUNE (number)",null,null,null,{"$f":"Impact!AA18","v":0},null,null,null,{"$f":"Impact!CW17","v":0},null,null,null,"MAJOR PRUNE (number)",null,null,null,{"$f":"Impact!AF18","v":0},null,null,null,"N/A",null,null,null,null,null,null,{"$f":"BlankImpact!AZ18","v":0}]
["Area to be Removed (ha)",null,null,null,{"$f":"Impact!AA19","v":0},null,null,null,{"$f":"Impact!CW7","v":0},null,null,null,"Area to be Removed (ha)",null,null,null,{"$f":"Impact!AF19","v":0},null,null,null,{"$f":"(IF(Q9=\"\",\"\",Q9*2))","v":0},null,null,null,"Number to be Major Pruned",null,null,{"$f":"Impact!AH18","v":0}]
["TOTAL SEB",null,null,null,null,null,null,null,{"$f":"SUM(I7:L9)","v":0},null,null,null,null,null,null,null,null,null,null,null,null,null,null,null,null,null,null,{"$f":"BlankImpact!AZ20","v":0}]
["IMPACT LEVEL",null,null,{"$f":"Summary!B16","v":3},{"$f":"IF(Summary!C16=\"\",\"\",(Summary!C16))","v":""},null,null,null,null,null,null,null,"IMPACT LEVEL",null,null,{"$f":"Summary!F16","v":0},{"$f":"IF(Summary!G16=\"\",\"\",(Summary!G16))","v":""},null,null,null,null,null,null,null,"APPROVING AUTHORITY",null,null,"DPTI - Principal Environmental Advisor"]
["APPROVING AUTHORITY",null,null,null,{"$f":"IF(Summary!C17=\"\",\"\",(Summary!C17))","v":"PEA/GMID endorse, NVMU approve"},null,null,null,null,null,null,null,"APPROVING AUTHORITY",null,null,null,{"$f":"IF(Summary!G17=\"\",\"\",(Summary!G17))","v":"PEA/GMID endorse, NVMU approve"}]
[]
["PAYMENT INTO NVC FUND OPTION",null,null,null,null,null,null,null,null,null,null,null,"PAYMENT AMOUNT FOR SCATTERED TREES",null,null,null,null,null,"PAYMENT AMOUNT FOR AREA",null,null,null,null,null,"TOTAL PAYMENT INTO THE  NVC FUND"]
[null,null,null,null,null,null,null,null,null,null,null,null,{"$f":"Impact!$DB$12","v":0},null,null,null,null,null,{"$f":"Impact!$DE$12","v":0},null,null,null,null,null,{"$f":"SUM(M15:X15)","v":0}]
["PAYMENT INTO AMENITY PLANTING FUND OPTION\n(Applies to clearance under Regulation 5(1)(lb) only & is a DPTI self imposed Off-set)",null,null,null,null,null,null,null,null,null,null,null,"PAYMENT AMOUNT FOR SCATTERED TREES",null,null,null,null,null,"PAYMENT AMOUNT FOR AREA",null,null,null,null,null,"TOTAL PAYMENT INTO DTPI AMENITY PLANTING FUND"]
[null,null,null,null,null,null,null,null,null,null,null,null,{"$f":"U7*96","v":0},null,null,null,null,null,{"$f":"U9*5000","v":0},null,null,null,null,null,{"$f":"SUM(M17:X17)","v":0}]
[]
["COMMENTS"]

{"sheet":"GIS Dump","index":8,"n_rows":1,"n_cols":18,"rows_kept":1,"cut":false,"hidden":false,"merged":[]}
["ID","Vsnum","Location","PhotoRef","Species","East","North","Number","Area","NatVeg","NVA","DAC","RegSig","Removal","MajPrun","MinPrun","Monitor","Remarks"]

{"sheet":"BlankVegRemovalRequest","index":9,"n_rows":73,"n_cols":19,"rows_kept":73,"cut":false,"hidden":true,"merged":[[47,0,47,13],[47,14,47,18],[50,0,50,18],[43,0,43,13],[43,14,43,18],[45,0,45,18],[46,0,46,13],[46,14,46,18],[39,0,39,18],[40,0,40,13],[40,14,40,18],[41,0,41,13],[41,14,41,18],[42,0,42,13],[42,14,42,18],[36,0,38,9],[36,10,36,14],[36,15,36,16],[36,17,36,18],[37,10,38,14],[37,15,37,16],[37,17,37,18],[38,15,38,16],[38,17,38,18],[33,0,33,16],[34,0,34,9],[34,10,34,15],[34,16,34,18],[35,0,35,9],[35,10,35,18],[31,8,31,9],[32,0,32,5],[32,8,32,9],[32,10,32,12],[32,13,32,18],[27,8,27,9],[28,0,28,5],[28,8,28,9],[23,8,23,13],[24,0,24,9],[24,10,26,18],[25,0,26,5],[25,6,25,7],[25,8,26,9],[27,10,31,18],[29,0,29,5],[29,8,29,9],[30,0,30,5],[30,8,30,9],[22,0,23,7],[27,0,27,5],[31,0,31,5],[17,10,17,13],[18,8,19,9],[18,10,18,13],[19,10,19,13],[20,8,22,9],[20,10,20,13],[21,10,21,13],[22,10,22,13],[12,0,12,7],[12,8,12,18],[13,8,14,9],[13,10,14,13],[13,14,13,16],[13,17,13,18],[15,8,17,9],[15,10,15,13],[16,10,16,13],[13,0,20,7],[21,0,21,7],[7,16,8,18],[8,0,8,9],[9,0,9,5],[9,13,9,15],[9,16,9,18],[9,6,9,9],[10,6,10,9],[11,6,11,9],[7,10,8,12],[9,10,9,12],[10,10,11,12],[7,3,7,5],[7,6,7,9],[53,0,53,5],[54,0,54,1],[0,0,0,8],[0,10,0,14],[0,15,0,18],[1,0,1,8],[1,10,1,14],[1,15,3,18],[2,0,5,9],[2,10,2,14],[3,10,3,14],[4,10,4,14],[4,15,4,18],[5,10,5,14],[5,15,6,18],[6,10,6,14],[6,0,6,2],[6,3,6,5],[6,6,6,9],[7,0,7,2],[10,0,11,5],[10,13,11,15],[10,16,11,18],[7,13,8,15]]}
["DEPARTMENT OF PLANNING TRANSPORT & INFRASTRUCTURE",null,null,null,null,null,null,null,null,null,"LGA",null,null,null,null,"VEGETATION SURVEY NO."]
["SAFETY & SERVICE DIVISION",null,null,null,null,null,null,null,null,null,"1  -  ",null,null,null,null,"VS 201X/XXX"]
["VEGETATION REMOVAL REQUEST",null,null,null,null,null,null,null,null,null,"2  - "]
[null,null,null,null,null,null,null,null,null,null,"3  - "]
[null,null,null,null,null,null,null,null,null,null,"4  -  ",null,null,null,null,"DPTI FILE NUMBER"]
[null,null,null,null,null,null,null,null,null,null,"5  -  ",null,null,null,null,"201X/XXXXX/XX"]
["REQUESTING OFFICER",null,null,"REQUESTING COMPANY",null,null,"DPTI PROJECT MANAGER",null,null,null,"6  -  "]
[null,null,null,null,null,null,null,null,null,null,"SHAPEFILE (KNET#)",null,null,"START \nMM/GPS",null,null,"END\nMM/GPS"]
["Project Name: "]
["Road No.:",null,null,null,null,null,"NRM BOARD(S)"]
["Location:"]
[]
["PROJECT DESCRIPTION & REASON FOR VEGETATION REMOVAL",null,null,null,null,null,null,null,"IMPACTS & OFFSETS"]
[null,null,null,null,null,null,null,null,"Legislation or Policy",null,"VEGETATION APPROVAL CATEGORY",null,null,null,"IMPACTS",null,null,"OFFSET"]
[null,null,null,null,null,null,null,null,null,null,null,null,null,null,"Removal\n(Number)","Major Prune\n(Number)","Removal\n(Area - ha)","Number","Area (ha) or SEB Points"]
[null,null,null,null,null,null,null,null,"Native Vegetation Act",null,"Clearance for New Works ",null,null,null,null,null,null,"N/A"]
[null,null,null,null,null,null,null,null,null,null,"Clearance for Maintenance (eg structurally unsound; within the clearance envelope)",null,null,null,null,null,null,"N/A","N/A"]
[null,null,null,null,null,null,null,null,null,null,"Clearance under Safety Regulation 5(1)(lb)"]
[null,null,null,null,null,null,null,null,"Development Act",null,"Regulated Trees",null,null,null,null,null,"N/A",{"$f":"(IF(O19=\"\",\"\",O19*2))","v":""},"N/A"]
[null,null,null,null,null,null,null,null,null,null,"Regulated Significant Trees",null,null,null,null,null,"N/A",{"$f":"(IF(O20=\"\",\"\",O20*3))","v":""},"N/A"]
[null,null,null,null,null,null,null,null,"DPTI Vegetation Removal Policy",null,"Declared/Environmental Weeds and/or Self-seeded Plants",null,null,null,null,null,null,"N/A","N/A"]
["TYPE OF VEGETATION IMPACTED",null,null,null,null,null,null,null,null,null,"Amenity Planting (including vegetation incidental to maintenance eg structurally unsound)",null,null,null,null,null,null,{"$f":"(IF(O22=\"\",\"\",O22))","v":""},{"$f":"(IF(Q22=\"\",\"\",Q22))","v":""}]
["eg Eucalyptus fasciculosa Open Woodland (Area) or \nEucalyptus camaldulensis (Scattered Tree/s)\n",null,null,null,null,null,null,null,null,null,"Native Vegetation not covered by the Native Vegetation Act (including vegetation incidental to maintenance eg structurally unsound)",null,null,null,null,null,null,{"$f":"(IF(O23=\"\",\"\",O23*2))","v":""},{"$f":"(IF(Q23=\"\",\"\",Q23*2))","v":""}]
[null,null,null,null,null,null,null,null,"TOTAL",null,null,null,null,null,{"$f":"SUM(O16:O23)","v":0},{"$f":"SUM(P16:P23)","v":0},{"$f":"SUM(Q16:Q23)","v":0},{"$f":"SUM(R16:R23)","v":0},{"$f":"SUM(S16:S23)","v":0}]
["DELIVERY OF OFFSETS",null,null,null,null,null,null,null,null,null,"OFFSET DELIVERY DETAILS & OTHER COMMENTS\n(Note to start another line within a cell press Alt Enter)"]
["OPTIONS FOR THE DELIVERY OF OFFSET",null,null,null,null,null,"OFFSET",null,"Amount ($)"]
[null,null,null,null,null,null,"Number","Area (ha)"]
["Payment into the Native Vegetation Fund*",null,null,null,null,null,"N/A"]
["Payment into the Planning & Development Fund",null,null,null,null,null,null,"N/A",{"$f":"G29*89.5","v":0}]
["On Ground Works"]
["Payment to a Third Party"]
["Payment into the Amenity Planting Fund (DPTI)*#",null,null,null,null,null,null,null,{"$f":"(G32*89.5)+(H32*5000)","v":0}]
["TOTAL",null,null,null,null,null,{"$f":"SUM(G28:G32)","v":0},{"$f":"SUM(H28:H32)","v":0},{"$f":"SUM(I28:I32)","v":0},null,"eg 7500 22027890 51000",null,null,"*Insert Budget Line; Resp; Project & Task Numbers if a Payment Option is selected"]
["# Note - for payments into the Amenity Planting Fund, the project will be charged at the END OF FINANCIAL YEAR"]
["DEPARTMENT OF PLANNING TRANSPORT & INFRASTRUCTURE",null,null,null,null,null,null,null,null,null,"DPTI File No.",null,null,null,null,null,{"$f":"(IF(P4=\"\",\"\",P4))","v":""}]
["SAFETY AND SERVICES DIVISION",null,null,null,null,null,null,null,null,null,{"$f":"Main!F2","v":"Project Name: "}]
["VEGETATION REMOVAL REQUEST",null,null,null,null,null,null,null,null,null,{"$f":"Main!F3","v":"Road Number : "},null,null,null,null,"Start MM/GPS",null,"End MM/GPS"]
[null,null,null,null,null,null,null,null,null,null,{"$f":"Main!F4","v":"Location :"},null,null,null,null,{"$f":"(IF(N10=\"\",\"\",N10))","v":""},null,{"$f":"(IF(Q10=\"\",\"\",Q10))","v":""}]
[null,null,null,null,null,null,null,null,null,null,null,null,null,null,null,{"$f":"(IF(N11=\"\",\"\",N11))","v":""},null,{"$f":"(IF(Q11=\"\",\"\",Q11))","v":""}]
["EXTERNAL APPROVALS"]
["Native Vegetation Council (Native Vegetation Act,1991)"]
["Development Assessment Commission (Development Act,1993)"]
["Minister for Aboriginal Affairs (Aboriginal Heritage Act,1988)"]
["Federal Environment Minister (EPBC Act,1999)"]
[]
["EXTERNAL CONSULTATION"]
["The local Council(s) has been consulted on the removal of the vegetation and the offset, if located in the road reserve."]
[]
[]
[]
["The removal of the vegetation proposed above has been minimised and is considered necessary and unavoidable. Approval for removal is recommended:"]
[]
[]
["Project Manager"]
["     /     /"]
[]
[]
["To the Principal Environmental Advisor"]
["The above request has been endorsed."]
[]
[]
[]
["Senior Environmental Advisor"]
["     /     /"]
[]
[]
["To the Project Manager"]
["The above request has been approved."]
[]
[]
[]
["Principal Environmental Advisor"]
["     /     /"]

{"sheet":"BlankNative Veg List","index":10,"n_rows":38,"n_cols":110,"rows_kept":38,"cut":false,"hidden":true,"merged":[[10,109,18,109],[5,100,18,100],[11,101,12,102],[13,101,13,102],[14,101,14,102],[0,101,4,102],[0,98,4,100],[1,109,4,109],[0,66,18,66],[0,67,18,67],[0,68,18,68],[0,69,7,69],[8,69,18,69],[0,73,18,73],[0,74,18,74],[0,75,18,75],[0,76,5,85],[6,76,18,76],[6,77,18,77],[6,78,18,78],[6,79,18,79],[6,80,18,80],[6,81,18,81],[6,82,18,82],[6,83,18,83],[6,84,18,84],[6,85,18,85],[36,101,36,102],[32,101,32,102],[35,101,35,102],[34,86,34,99],[5,98,18,98],[5,99,18,99],[31,86,31,99],[0,86,18,86],[0,87,18,87],[0,88,14,88],[15,88,16,88],[17,88,18,88],[34,101,34,102],[31,101,31,102],[33,101,33,102],[15,101,18,102],[0,89,18,89],[0,62,18,62],[0,63,18,63],[6,53,19,53],[6,42,19,42],[6,43,19,43],[6,44,19,44],[6,45,19,45],[6,46,19,46],[6,50,19,50],[31,21,31,25],[34,21,34,25],[0,64,18,64],[19,1,19,26],[12,1,18,1],[12,2,18,2],[5,0,6,4],[12,0,18,0],[7,0,11,4],[0,0,0,4],[0,22,18,22],[0,21,18,21],[1,0,1,4],[6,37,19,37],[16,4,18,4],[6,47,19,47],[6,32,19,32],[6,33,19,33],[6,34,19,34],[0,23,6,23],[7,23,9,23],[10,23,18,23],[6,12,14,15],[6,27,19,27],[0,65,18,65],[0,16,18,16],[5,20,18,20],[0,19,18,19],[0,18,18,18],[0,17,18,17],[6,35,19,35],[6,36,19,36],[0,26,18,26],[0,25,18,25],[0,24,18,24],[6,51,19,51],[6,52,19,52],[6,49,19,49],[6,48,19,48],[6,31,19,31],[6,28,19,28],[6,29,19,29],[6,30,19,30],[6,38,19,38],[6,39,19,39],[6,40,19,40],[6,41,19,41],[0,61,18,61]]}
[{"$f":"Main!A2","v":"DEPARTMENT OF PLANNING, TRANSPORT &  INFRASTRUCTURE"},null,null,null,null,null,null,null,null,null,null,null,null,null,null,null,"Off-set is Negated - eg DEAD vegetation with no habitat value (Y/N)","Veg is structurally unsound/within the Clearance Envelope etc (Y/N)","REGULATION 5(1)(lb) APPLIES (Y/N)","Area reporting selected in lieu of individual reporting (Y/N)",null,"AREA TO BE REMOVED SUBJECT TO THE NVA","NVA SEB Multipliation Factor (Condition)",{"$f":"SUM($X$20:$X$4064)","v":0},"EASTING","NORTHING","NUMBER OF SCATTERED TREES TO BE REMOVED (If a number is shown in \"Area\" column, an area Impact/SEB has been used in lieu of individual counts)",null,null,null,null,null,null,null,null,null,null,null,null,null,null,null,null,null,null,null,null,null,null,null,null,null,null,null,"A","B","C","D","E","F",{"$f":"SUM($BI$33:$BI$4912)","v":0},"SINGLE-STEMMED(S) OR  MULTI-STEMMED(M) SPECIMEN","BUTT DIA (M). IN GROUP AND/OR MS SITUATIONS INSERT HIGHEST RANGE READING","BUTT DIA (M). ONLY USE THIS COLUMN IN A GROUP AND/OR MS SITUATION INSERT LOWEST  RANGE","CIRCUMFERENCE (M) DEVELOPMENT ACT REQUIREMENT ONLY","HEIGHT (m) - In GROUP situations insert HIGHEST range reading.","HEIGHT (m) - In GROUP situations insert LOWEST range reading.","SPREAD (m) - In GROUP situations insert WIDEST range reading.","SPREAD (m) - In GROUP situations insert NARROWEST range reading.","E\nG\nF\nP\nD",null,null,null,"%  DIEBACK","HOLLOWS (NUMBER)","HOLLOW ENTRANCE SIZE (METRES)","WILDLIFE HABITAT VALUE CATEGORIES\n(LABELLED 1- 6)",null,null,null,null,null,null,null,null,null,"TOTAL SCORE","RECOMMENDATION","A 'FALSE' reading indicates Refusal under normal circumstances.","SEB Offset Area Requirement (total removal scattered trees)","APPROVALS",null,null,"SET ASIDE",null,null,null,null,"OFF-SETS",null,null,"LGC AVERAGE LAND VALUE ",null,"Calculations for Scattered Tree Payment for each LGC",null,null,"Calculations for Area Payment for each LGC",null,null,"COUNCIL(S)"]
[{"$f":"Main!A3","v":"SAFETY & SERVICE DIVISION            Revision - August 2018"},null,null,null,null,null,null,null,null,null,null,null,null,null,null,null,null,null,null,null,null,null,null,null,null,null,null,null,null,null,null,null,null,null,null,null,null,null,null,null,null,null,null,null,null,null,null,null,null,null,null,null,null,null,null,null,null,null,null,null,null,null,null,null,null,null,null,null,null,null,null,null,null,null,null,null,null,null,null,null,null,null,null,null,null,null,null,null,null,null,null,null,null,null,null,null,null,null,null,null,null,null,null,null,null,null,null,null,null,{"$f":"Main!$F$9","v":"1  -  "}]
[]
[]
[]
[{"$f":"(IF(Main!$E$4=\"\",\"\",Main!$E$4))","v":"VS 2017/???"},null,null,null,null,null,null,null,null,null,null,null,null,null,null,null,null,null,null,null,"AREA OF VEGETATION TO BE REMOVED (m2).",null,null,null,null,null,null,null,null,null,null,null,null,null,null,null,null,null,null,null,null,null,null,null,null,null,null,null,null,null,null,null,null,null,null,null,null,null,null,null,null,null,null,null,null,null,null,null,null,null,null,null,null,null,null,null,null,null,null,null,null,null,null,null,null,null,null,null,null,null,null,null,null,null,null,null,null,null,"Number - Regulation 5(1)(lb) Only - 2:1","Area (ha)\n(Condition Score x Area)","SEB Offset Area Requirement for Scattered Trees (Ha)",1,{"$f":"(IF(BlankImpact!CY6=\"\",\"\",BlankImpact!CY6))","v":""},null,null,null,null,null,null,{"$f":"Main!$F$10","v":"2  -  "}]
[null,null,null,null,null,null,"CLEARANCE ENVELOPE (S - STANDARD, R - RESTRICTED)","SIDE OF ROAD (L - LEFT, R - RIGHT)","Width of the Travelway","Distance - Centreline to Edgeline","Distance of Tree from the Edgeline\n(Show in RED if behind Guardrailing)","Clearance @ Edgeline OR Edge of Envelope","IMPACT OR RECOMMENDED ACTION",null,null,null,null,null,null,null,null,null,null,null,null,null,null,"STANDARD CLEARANCE\nREMOVAL \nNumber of Native Veg","STANDARD CLEARANCE\nMAJOR PRUNE\nNumber of Native Veg","Area of Native Veg","Regulation 5(1)(lb)\nREMOVAL \nNumber of Native Veg","Regulation 5(1)(lb)\nMAJOR PRUNE\nNumber of Native Veg","Regulation 5(1)(lb)\nArea of Native Veg","STRUCTURALLY UNSOUND\nREMOVAL \nNumber of Native Veg","STRUCTURALLY UNSOUND\nMAJOR PRUNE\nNumber of Native Veg","REMOVAL\nNumber of weeds and \"others\" excluding amenity planting","MAJOR PRUNE\nNumber of weeds and \"others\" excluding amenity planting","AREA OF WEEDS EXCLUDING AMENITY","REMOVAL\nNumber - Native Vegetation Not covered by ACT","MAJOR PRUNE\nNumber - Native Vegetation Not covered by ACT","Area - Native Vegetation Not covered by ACT","STRUCTURALLY UNSOUND\nREMOVAL \nNumber - Native Vegetation Not covered by ACT","STRUCTURALLY UNSOUND\nMAJOR PRUNE\nNumber - Native Vegetation Not covered by ACT","STANDARD CLEARANCE\nREMOVAL\nNumber - Amenity Planting","STANDARD CLEARANCE\nMAJOR PRUNE\nNumber - Amenity Planting","Area - Amenity Planting","STRUCTURALLY UNSOUND\nREMOVAL \nNumber - Amenity Planting","STRUCTURALLY UNSOUND\nMAJOR PRUNE\nNumber - Amenity Planting","REMOVAL\nNumber - Regulated Significant Trees","SEB\nNumber - Regulated Significant Trees","MAJOR PRUNE\nNumber - Regulated Significant Trees","REMOVAL\nNumber - Regulated Trees","SEB\nNumber - Regulated Trees","MAJOR PRUNE\nNumber - Regulated Trees",null,null,null,null,null,null,null,null,null,null,null,null,null,null,null,null,null,null,null,null,null,null,"1. HEIGHT (WEIGHTED)","2. HEALTH (WEIGHTED)","HOLLOWS 1, 2 OR 3 POINTS","3. HOLLOWS (WEIGHTED)","SUITABILITY FOR THREATENED SPECIES ","4. THREATENED SPECIES (WEIGHTED)","DENSITY","5. DENSITY  (WEIGHTED)","PROXIMITY TO OTHER VEG","6. PROXIMITY TO OTHER VEG. (WEIGHTED)",null,null,null,null,null,null,null,null,null,null,null,null,null,null,null,2,{"$f":"(IF(BlankImpact!CY7=\"\",\"\",BlankImpact!CY7))","v":""},null,null,null,null,null,null,{"$f":"Main!$F$11","v":"3  -  "}]
["Native Vegetation Impacts\nNative Vegetation Act, 1991",null,null,null,null,null,null,null,null,null,null,null,null,null,null,null,null,null,null,null,null,null,null,"TOTAL",null,null,null,null,null,null,null,null,null,null,null,null,null,null,null,null,null,null,null,null,null,null,null,null,null,null,null,null,null,null,null,null,null,null,null,null,"TOTAL",null,null,null,null,null,null,null,null,null,null,null,null,null,null,null,null,null,null,null,null,null,null,null,null,null,null,null,null,null,null,null,null,null,null,null,null,null,null,null,null,3,{"$f":"(IF(BlankImpact!CY8=\"\",\"\",BlankImpact!CY8))","v":""},null,null,null,null,null,null,{"$f":"Main!$F$12","v":"4  -  "}]
[null,null,null,null,null,null,null,null,null,null,null,null,null,null,null,null,null,null,null,null,null,null,null,null,null,null,null,null,null,null,null,null,null,null,null,null,null,null,null,null,null,null,null,null,null,null,null,null,null,null,null,null,null,null,null,null,null,null,null,null,null,null,null,null,null,null,null,null,null,"HEALTH & CONDITION *",null,null,null,null,null,null,null,null,null,null,null,null,null,null,null,null,null,null,null,null,null,null,null,null,null,null,null,null,null,null,null,4,{"$f":"(IF(BlankImpact!CY9=\"\",\"\",BlankImpact!CY9))","v":""},{"$f":"IF(CY9=\"\",\"\",(SUMIF(A33:A34,\"1\",CW33:CW34)+(SUMIF(A36:A36,\"1\",CW36:CW36)/100*20)))","v":""},{"$f":"IF(CY9=\"\",\"\",(SUMIF(A33:A34,\"1\",CX33:CX34)+(SUMIF(A36:A36,\"1\",CX36:CX36)*20/100)))","v":""},{"$f":"IF(CY9=\"\",\"\",(($CZ$9*$CY$9)+(800*$DA$9)))","v":""},{"$f":"IF(CY9=\"\",\"\",(SUMIF(A33:A34,\"1\",CP33:CP34)))","v":""},{"$f":"IF(CY9=\"\",\"\",(SUMIF(A33:A34,\"1\",V33:V34)/10000))","v":""},{"$f":"IF(CY9=\"\",\"\",(($DC$9*$CY$9)+(800*$DD$9)))","v":""},{"$f":"Main!$F$13","v":"5  -  "}]
[null,null,null,null,null,null,null,null,null,null,null,null,null,null,null,null,null,null,null,null,null,null,null,null,null,null,null,null,null,null,null,null,null,null,null,null,null,null,null,null,null,null,null,null,null,null,null,null,null,null,null,null,null,null,null,"AMENITY PLANTING","NATIVE VEGETATION","SUBJECT TO NATIVE VEGETATION ACT","SUBJECT TO DEVELOPMENT ACT",null,"NO IN GROUP WITH BUTT DIA. 0.15+ OR MS 0.10+",null,null,null,null,null,null,null,null,null,null,null,null,null,null,null,null,null,null,null,null,null,null,null,null,null,null,null,null,null,null,null,null,null,null,null,null,null,null,null,null,5,{"$f":"(IF(BlankImpact!CY10=\"\",\"\",BlankImpact!CY10))","v":""},null,null,null,null,null,null,{"$f":"Main!$F$14","v":"6  -  "}]
[null,null,null,null,null,null,null,null,null,null,null,null,null,null,null,null,null,null,null,null,null,null,null,"NVA SEB for AREA (HA)",null,null,null,null,null,null,null,null,null,null,null,null,null,null,null,null,null,null,null,null,null,null,null,null,null,null,null,null,null,null,null,null,null,null,null,null,null,null,null,null,null,null,null,null,null,null,null,null,null,null,null,null,null,null,null,null,null,null,null,null,null,null,null,null,null,null,null,null,null,null,null,null,null,null,null,null,null,6,{"$f":"(IF(BlankImpact!CY11=\"\",\"\",BlankImpact!CY11))","v":""},null,null,null,null,null,null,"COMMENTS"]
[null,null,null,null,null,null,null,null,null,null,null,null,null,null,null,null,null,null,null,null,null,null,null,null,null,null,null,null,null,null,null,null,null,null,null,null,null,null,null,null,null,null,null,null,null,null,null,null,null,null,null,null,null,null,null,null,null,null,null,null,null,null,null,null,null,null,null,null,null,null,null,null,null,null,null,null,null,null,null,null,null,null,null,null,null,null,null,null,null,null,null,null,null,null,null,null,null,null,null,null,null,"NRM BOARD(S)",null,{"$f":"IF(CY12=\"\",\"\",(SUMIF(A33:A34,\"2\",CW33:CW34)+(SUMIF(#REF!,\"2\",#REF!)/100*20)))","v":""},{"$f":"IF(CY12=\"\",\"\",(SUMIF(A33:A34,\"2\",CX33:CX34)+(SUMIF(A36:A36,\"2\",CX36:CX36)*20/100)))","v":""},{"$f":"IF(CY12=\"\",\"\",(($CZ$12*$CY$12)+(800*$DA$12)))","v":""},{"$f":"IF(CY12=\"\",\"\",(SUMIF(A33:A34,\"2\",CP33:CP34)))","v":""},{"$f":"IF(CY12=\"\",\"\",(SUMIF(A33:A34,\"2\",V33:V34)/10000))","v":""},{"$f":"IF(CY12=\"\",\"\",(($DC$12*$CY$12)+(800*$DD$12)))","v":""}]
["LGC (ALLOCATED NUMBER)","PLAN REFERENCE OR MM LOCATION","PHOTO REFERENCE",null,{"$f":"Main!$F$2","v":"Project Name: "}]
[null,null,null,null,{"$f":"Main!$F$3","v":"Road Number : "},null,null,null,null,null,null,null,null,null,null,null,null,null,null,null,null,null,null,null,null,null,null,null,null,null,null,null,null,null,null,null,null,null,null,null,null,null,null,null,null,null,null,null,null,null,null,null,null,null,null,null,null,null,null,null,null,null,null,null,null,null,null,null,null,null,null,null,null,null,null,null,null,null,null,null,null,null,null,null,null,null,null,null,null,null,null,null,null,null,null,null,null,null,null,null,null,{"$f":"(IF(BlankSummary!I62=\"\",\"\",BlankSummary!I62))","v":""},null,{"$f":"IF(CY14=\"\",\"\",(SUMIF(A33:A34,\"3\",CW33:CW34)+(SUMIF(A36:A36,\"3\",CW36:CW36)/100*20)))","v":""},{"$f":"IF(CY14=\"\",\"\",(SUMIF(A33:A34,\"3\",CX33:CX34)+SUMIF(A36:A36,\"3\",CX36:CX36)*20/100))","v":""},{"$f":"IF(CY14=\"\",\"\",(($CZ$14*$CY$14)+(800*$DA$14)))","v":""},{"$f":"IF(CY14=\"\",\"\",(SUMIF(A33:A34,\"3\",CP33:CP34)))","v":""},{"$f":"IF(CY14=\"\",\"\",(SUMIF(A33:A34,\"3\",V33:V34)/10000))","v":""},{"$f":"IF(CY14=\"\",\"\",(($DC$14*$CY$14)+(800*$DD$14)))","v":""}]
[null,null,null,null,{"$f":"Main!$F$4","v":"Location :"},null,null,null,null,null,null,null,null,null,null,null,null,null,null,null,null,null,null,null,null,null,null,null,null,null,null,null,null,null,null,null,null,null,null,null,null,null,null,null,null,null,null,null,null,null,null,null,null,null,null,null,null,null,null,null,null,null,null,null,null,null,null,null,null,null,null,null,null,null,null,null,null,null,null,null,null,null,null,null,null,null,null,null,null,null,null,null,null,null,null,null,null,null,null,null,null,{"$f":"(IF(BlankSummary!I63=\"\",\"\",BlankSummary!I63))","v":""}]
[null,null,null,null,null,null,null,null,null,null,null,null,null,null,null,null,null,null,null,null,null,null,null,null,null,null,null,null,null,null,null,null,null,null,null,null,null,null,null,null,null,null,null,null,null,null,null,null,null,null,null,null,null,null,null,null,null,null,null,null,null,null,null,null,null,null,null,null,null,null,null,null,null,null,null,null,null,null,null,null,null,null,null,null,null,null,null,null,"Number \"False\"",null,null,null,null,null,null,null,null,null,null,null,null,"CANOPY AREAS (SCATTERED TREES)"]
[null,null,null,null,{"$f":"BlankImpact!E12","v":"Date : ???"},null,null,null,null,null,null,null,"REMOVAL","MAJOR PRUNE","MINOR PRUNE","MONITOR",null,null,null,null,null,null,null,null,null,null,null,null,null,null,null,null,null,null,null,null,null,null,null,null,null,null,null,null,null,null,null,null,null,null,null,null,null,null,null,null,null,null,null,null,null,null,null,null,null,null,null,null,null,null,null,null,null,null,null,null,null,null,null,null,null,null,null,null,null,null,null,null,null,null,null,null,null,null,null,null,null,null,null,null,null,null,null,{"$f":"SUM(CZ9:CZ15)","v":0},0,0,0,0,0]
[null,null,null,null,null,null,null,null,null,null,null,null,null,null,null,null,null,null,null,null,null,null,null,null,null,null,null,null,null,null,null,null,null,null,null,null,null,null,null,null,null,null,null,null,null,null,null,null,null,null,null,null,null,null,null,null,null,null,null,null,null,null,null,null,null,null,null,null,null,null,null,null,null,null,null,null,null,null,null,null,null,null,null,null,null,null,null,null,{"$f":"COUNTIF($CK$21:$CK$4913,\"FALSE\")","v":0}]
[]
[null,"Native vegetation removal is required as part of the project described above.\nTree numbers and descriptions are listed as per the attached Vegetation Survey",null,null,null,null,null,null,null,null,null,null,null,null,null,null,null,null,null,null,null,null,null,null,null,null,null,null,null,null,null,null,null,null,null,null,null,null,null,null,null,null,null,null,null,null,null,null,null,null,null,null,null,null,null,null,null,null,null,null,null,null,null,null,null,null,null,null,null,null,null,null,null,null,null,null,null,null,null,null,null,null,null,null,null,null,null,null,null,null,null,null,null,null,null,null,null,null,null,null,null,null,null,null,null,null,null,null,null,"COMMENTS"]
[null,null,null,null,"Totals","Native Veg     Removals",null,null,null,null,null,null,null,null,null,null,null,null,null,null,null,null,null,null,null,null,{"$f":"(SUMIF(BF33:BF34,\"Y\",AA33:AA34)-(SUMIF(R33:R34,\"Y\",AA33:AA34)))","v":0},null,null,null,null,null,null,null,null,null,null,null,null,null,null,null,null,null,null,null,null,null,null,null,null,null,null,null,null,null,null,null,null,{"$f":"SUM(BH33:BH34)","v":0},null,null,null,null,null,null,null,null,null,null,null,null,null,null,null,null,null,null,null,null,null,null,null,null,null,null,null,null,null,null,null,null,null,null,null,null,null,null,null,null,{"$f":"CW35","v":0}]
[null,null,null,null,null,"Major Prune",null,null,null,null,null,null,null,null,null,null,null,null,null,null,null,null,null,null,null,null,{"$f":"(SUMIF(BF36:BF36,\"Y\",AA36:AA36))","v":0},null,null,null,null,null,null,null,null,null,null,null,null,null,null,null,null,null,null,null,null,null,null,null,null,null,null,null,null,null,null,null,null,{"$f":"SUM(BH36:BH36)","v":0}]
[null,null,null,null,"Totals","Environmental Weeds     Removals",null,null,null,null,null,null,null,null,null,null,null,null,null,null,null,null,null,null,null,null,{"$f":"SUM(AB33:AB34)","v":0}]
[null,null,null,null,null,"Major Prune",null,null,null,null,null,null,null,null,null,null,null,null,null,null,null,null,null,null,null,null,{"$f":"SUM(AB36:AB36)","v":0}]
[null,null,null,null,null,"Area",null,null,null,null,null,null,null,null,null,null,null,null,null,null,null,null,null,null,null,null,{"$f":"SUM($AC33:$AC34)","v":0}]
[null,null,null,null,"Totals","Amenity     Removals",null,null,null,null,null,null,null,null,null,null,null,null,null,null,null,null,null,null,null,null,{"$f":"(SUMIF(BD33:BD34,\"Y\",AA33:AA34))","v":0}]
[null,null,null,null,null,"Major Prune",null,null,null,null,null,null,null,null,null,null,null,null,null,null,null,null,null,null,null,null,{"$f":"(SUMIF(BD36:BD36,\"Y\",AA36:AA36))","v":0}]
[null,null,null,null,null,"Area",null,null,null,null,null,null,null,null,null,null,null,null,null,null,null,null,null,null,null,null,{"$f":"(SUMIF($BD33:$BD34,\"Y\",$U33:$U34))","v":0}]
[null,null,null,null,null,"Native veg not covered by Act     Removals",null,null,null,null,null,null,null,null,null,null,null,null,null,null,null,null,null,null,null,null,{"$f":"SUM(AD33:AD34)","v":0}]
[null,null,null,null,"Totals","Major Prune",null,null,null,null,null,null,null,null,null,null,null,null,null,null,null,null,null,null,null,null,{"$f":"SUM(AD36:AD36)","v":0}]
[null,null,null,null,null,"Area",null,null,null,null,null,null,null,null,null,null,null,null,null,null,null,null,null,null,null,null,{"$f":"SUM(BB33:BB34)","v":0}]
[null,null,null,"jjjjj","REMOVALS\n(Areas and Scattered Trees)"]
[null,null,null,null,null,null,null,null,null,null,null,null,null,null,null,null,null,null,null,null,null,{"$f":"IF(BF33=\"\",\"\",(IF(U33=\"\",\"\",(IF(BF33=\"N\",\"\",(IF(BF33=\"Y\",U33)))))))","v":""},null,{"$f":"IF(V33=\"\",\"\",(IF(BF33=\"N\",\"\",((V33*W33)/10000))))","v":""},null,null,null,{"$f":"IF(M33=\"\",0,(IF(T33=\"\",0,(IF(T33=\"Y\",0,(IF(S33=\"Y\",0, (IF(R33=\"Y\",0,(IF(BF33=\"N\",0,(IF(M33=\"P\",AA33)))))))))))))","v":0},{"$f":"IF(N33=\"\",0,(IF(T33=\"\",0,(IF(T33=\"Y\",0,(IF(S33=\"Y\",0, (IF(R33=\"Y\",0,(IF(BF33=\"N\",0,(IF(N33=\"P\",AA33)))))))))))))","v":0},{"$f":"IF(M33=\"\",0,(IF(T33=\"\",0,(IF(T33=\"N\",0,(IF(S33=\"Y\",0,(IF(BF33=\"N\",0,(IF(T33=\"Y\",(X33))))))))))))","v":0},{"$f":"IF(M33=\"\",0,(IF(T33=\"\",0,(IF(T33=\"Y\",0,(IF(S33=\"N\",0,(IF(BF33=\"N\",0,(IF(M33=\"P\",AA33)))))))))))","v":0},{"$f":"IF(N33=\"\",0,(IF(T33=\"\",0,(IF(T33=\"Y\",0,(IF(S33=\"N\",0, (IF(BF33=\"N\",0,(IF(N33=\"P\",AA33)))))))))))","v":0},{"$f":"IF(M33=\"\",0,(IF(T33=\"\",0,(IF(S33=\"N\",0,(IF(BF33=\"N\",0,(IF(T33=\"N\",0,(IF(T33=\"Y\",U33)))))))))))","v":0},{"$f":"IF(M33=\"\",0,(IF(T33=\"\",0,(IF(T33=\"Y\",0,(IF(S33=\"Y\",0,(IF(R33=\"N\",0,(IF(BF33=\"N\",0,(IF(M33=\"P\",AA33)))))))))))))","v":0},{"$f":"IF(N33=\"\",0,(IF(T33=\"\",0,(IF(T33=\"Y\",0,(IF(R33=\"N\",0, (IF(BF33=\"N\",0,(IF(N33=\"P\",AA33)))))))))))","v":0},{"$f":"IF(M33=\"\",0,(IF(BC33=\"N\",0,(IF(BD33=\"Y\",0,(IF(T33=\"Y\",0,(IF(BC33=\"E\",AA33,(IF(BC33=\"D\",AA33,(IF(BC33=\"O\",AA33,(IF(BC33=\"M\",AA33)))))))))))))))","v":0},{"$f":"IF(N33=\"\",0,(IF(BH33>0,0,(IF(BC33=\"N\",0,(IF(BD33=\"Y\",0,(IF(T33=\"Y\",0,(IF(BC33=\"E\",AA33,(IF(BC33=\"D\",AA33,(IF(BC33=\"O\",AA33,(IF(BC33=\"M\",AA33)))))))))))))))))","v":0},{"$f":"IF(M33=\"\",0,(IF(U33=\"\",0,(IF(BC33=\"N\",0,(IF(BD33=\"Y\",0,IF(T33=\"N\",0,(IF(BC33=\"E\",U33,(IF(BC33=\"D\",U33,(IF(BC33=\"O\",U33,(IF(BC33=\"M\",U33))))))))))))))))","v":0},{"$f":"(IF(M33=\"\",0,(IF(AA33=\"\",0,(IF(BE33=\"N\",0,(IF(BF33=\"Y\",0,(IF(R33=\"Y\",0,(IF(BH33>0,0,(IF(T33=\"Y\",0,(IF(BE33=\"Y\",AA33))))))))))))))))","v":0},{"$f":"IF(N33=\"\",0,(IF(AA33=\"\",0,(IF(BE33=\"N\",0,(IF(BF33=\"Y\",0,(IF(BH33>0,0,(IF(R33=\"Y\",0,(IF(T33=\"Y\",0,(IF(BE33=\"Y\",AA33)))))))))))))))","v":0},{"$f":"IF(M33=\"\",0,(IF(U33=\"\",0,(IF(T33=\"N\",0,(IF(BE33=\"N\",0,(IF(BF33=\"Y\",0,(IF(BE33=\"Y\",U33)))))))))))","v":0},{"$f":"IF(M33=\"\",0,(IF(T33=\"\",0,(IF(T33=\"Y\",0,(IF(S33=\"Y\",0,(IF(R33=\"N\",0,(IF(BD33=\"Y\",0,(IF(BF33=\"Y\",0,(IF(M33=\"P\",AA33)))))))))))))))","v":0},{"$f":"IF(N33=\"\",0,(IF(T33=\"\",0,(IF(T33=\"Y\",0,(IF(R33=\"N\",0, (IF(BF33=\"Y\",0,(IF(BE33=\"N\",0,(IF(N33=\"P\",AA33)))))))))))))","v":0},{"$f":"IF(M33=\"\",0,(IF(T33=\"Y\",0,(IF(BG33=\"Y\",0,(IF(BD33=\"N\",0,(IF(R33=\"Y\",0,(IF(BD33=\"Y\",AA33)))))))))))","v":0},{"$f":"IF(N33=\"\",0,(IF(BD33=\"\",0,(IF(BD33=\"N\",0,(IF(BH33>0,0,(IF(T33=\"Y\",0,(IF(R33=\"Y\",0,(IF(BD33=\"Y\",AA33)))))))))))))","v":0},{"$f":"IF(M33=\"\",0,(IF(BD33=\"\",0,(IF(BD33=\"N\",0,(IF(T33=\"N\",0,(IF(Q33=\"Y\",0,(IF(BD33=\"Y\",U33)))))))))))","v":0},{"$f":"IF(M33=\"\",0,(IF(T33=\"\",0,(IF(T33=\"Y\",0,(IF(S33=\"Y\",0,(IF(R33=\"N\",0,(IF(BE33=\"Y\",0,(IF(M33=\"P\",AA33)))))))))))))","v":0},{"$f":"IF(N33=\"\",0,(IF(T33=\"\",0,(IF(T33=\"Y\",0,(IF(R33=\"N\",0, (IF(BE33=\"Y\",0,(IF(BD33=\"N\",0,(IF(N33=\"P\",AA33)))))))))))))","v":0},{"$f":"IF(M33=\"\",0,(IF(BF33=\"Y\",0,(IF(BH33=\"\",0,(IF(BG33=\"N\",0,(IF(BH33=\"R\",0,(IF(BH33=\"S\",AA33)))))))))))","v":0},{"$f":"(IF(AW33=0,0,AW33))*3","v":0},{"$f":"IF(N33=\"\",0,(IF(BF33=\"Y\",0,(IF(BG33=\"N\",0,(IF(BH33=\"R\",0,(IF(BH33=\"S\",AA33)))))))))","v":0},{"$f":"IF(M33=\"\",0,(IF(BF33=\"Y\",0,(IF(BG33=\"N\",0,(IF(BH33=\"\",0,(IF(BH33=\"S\",0,(IF(BH33=\"R\",AA33)))))))))))","v":0},{"$f":"(IF(AZ33=0,0,AZ33))*2","v":0},{"$f":"IF(N33=\"\",0,(IF(BF33=\"Y\",0,(IF(BG33=\"N\",0,(IF(BH33=\"S\",0,(IF(BH33=\"R\",AA33)))))))))","v":0},null,null,null,null,null,null,null,null,null,null,null,null,null,null,null,null,null,null,{"$f":"(IF(BT33=\"\",\"\",((BT33*50)^0.42)*0.64))","v":""},null,null,null,{"$f":"IF(BF33=\"\",\"\",(IF(BF33=\"N\",\"\",(IF(BF33=\"Y\",(IF(BN33=\"\",\"\",(IF($BN33<10,1,(IF($BN33<20,2,3))))*1.05)))))))","v":""},{"$f":"IF(BV33=\"\",\"\",(IF(BF33=\"N\",\"\",(IF(BF33=\"Y\",((100-$BV33)*0.04)+2)))))","v":""},null,{"$f":"IF(CA33=\"\",\"\",(IF(BF33=\"N\",\"\",(IF(BF33=\"Y\",(CA33*1.45))))))","v":""},null,{"$f":"IF(CC33=\"\",\"\",(IF(BF33=\"N\",\"\",(IF(BF33=\"Y\",(CC33*0.65))))))","v":""},null,{"$f":"IF(CE33=\"\",\"\",(IF(BF33=\"N\",\"\",(IF(BF33=\"Y\",(CE33*0.4))))))","v":""},null,{"$f":"IF(CG33=\"\",\"\",(IF(BF33=\"N\",\"\",(IF(BF33=\"Y\",(CG33*0.35))))))","v":""},{"$f":"IF(BY33=\"\",\"\",(SUM(BY33,BZ33,CB33,CD33,CF33,CH33)*SUM(BY33,BZ33,CB33,CD33,CF33,CH33)*SUM(BY33,BZ33,CB33,CD33,CF33,CH33)/55.5))","v":""},{"$f":"IF(CI33=\"\",\"\",IF(CI33<30,0,(IF(CI33>=30,1))))","v":""},{"$f":"IF(CI33=\"\",\"\",(IF(CJ33=1,CJ33=\"@\",(IF(CJ33=0,(IF($CI33<20,4*$CI33/550,(IF($CI33<30,6*$CI33/550,(IF($CI33<41,8*$CI33/550,(IF($CI33<61,10*$CI33/550,12*$CI33/550)))))))))))))","v":""},{"$f":"IF(CI33=\"\",\"\",((IF($CI33<20,4*$CI33/550,(IF($CI33<29.1,6*$CI33/550,(IF($CI33<40.1,8*$CI33/550,(IF($CI33<60.1,10*$CI33/550,12*$CI33/550))))))))*AA33))","v":""},{"$f":"IF(BF33=\"\",\"\",(IF(BF33=\"N\",\"\",(IF(T33=\"Y\",\"Y\",(IF(AA33=\"\",\"Y\",(IF(AA33=0,\"\",(IF(BF33=\"Y\",(AB33+AC33+AE33+AF33+AH33+AI33))))))))))))","v":""},{"$f":"IF(BG33=\"\",\"\",(IF(BG33=\"N\",\"\",(IF(BF33=\"Y\",\"\",(IF(Q33=\"Y\",\"\",(IF(BG33=\"Y\",(AW33+AY33+AZ33+BB33))))))))))","v":""},{"$f":"IF(Q33=\"Y\",\"\",(IF(BF33=\"Y\",\"\",(IF(BG33=\"Y\",\"\",(IF(T33=\"Y\",\"Y\",(IF(AA33=\"\",\"\",(IF(AJ33>0,BI33,(IF(AK33>0,BI33,(AM33+AN33+AR33+AS33+AU33+AV33))))))))))))))","v":""},{"$f":"(IF(AA33=\"\",\"\",(IF(M33=\"\",\"\",(IF(Q33=\"Y\",\"\",(IF(BG33=\"N\",\"\",(IF(BF33=\"Y\",\"\",(IF(BG33=\"Y\",(AX33+BA33)))))))))))))","v":""},{"$f":"IF(AT33=0,\"\",(IF(AQ33=\"Y\",\"\",(AT33))))","v":""},{"$f":"IF(AA33=\"\",\"\",(IF(Q33=\"Y\",\"\",(IF(AR33=0,\"\",(AR33))))))","v":""},{"$f":"IF(AM33=0,\"\",(IF(Q33=\"Y\",\"\",(AM33))))","v":""},{"$f":"IF(AM33=0,\"\",(IF(Q33=\"Y\",\"\",(AM33))))","v":""},{"$f":"(IF(AE33=0,\"\",(IF(Q33=\"Y\",\"\",(AE33*2)))))","v":""},{"$f":"IF(AD33=0,\"\",(IF(Q33=\"Y\",\"\",(AD33))))","v":""},{"$f":"IF(BN33=\"\",\"\",(IF(S33=\"Y\",\"\",(IF(R33=\"Y\",\"\",(IF(Q33=\"Y\",\"\",(IF(T33=\"Y\",\"\",(IF(BF33=\"\",\"\",(IF(BF33=\"N\",\"\",(CL33))))))))))))))","v":""},{"$f":"IF(BF33=\"\",\"\",(IF(BF33=\"N\",\"\",(IF(BP33=\"\",\"\",(IF(R33=\"Y\",\"\",(IF(T33=\"Y\",\"\",(IF($CY$6=\"\",\"\",(IF(AA33=\"\",\"\",(PI()*((BP33/2)*(BP33/2)))/10000*AA33)))))))))))))","v":""}]
[null,null,null,null,null,null,null,null,null,null,null,null,null,null,null,null,null,null,null,null,null,{"$f":"IF(BF34=\"\",\"\",(IF(U34=\"\",\"\",(IF(BF34=\"N\",\"\",(IF(BF34=\"Y\",U34)))))))","v":""},null,{"$f":"IF(V34=\"\",\"\",(IF(BF34=\"N\",\"\",((V34*W34)/10000))))","v":""},null,null,null,{"$f":"IF(M34=\"\",0,(IF(T34=\"\",0,(IF(T34=\"Y\",0,(IF(S34=\"Y\",0, (IF(R34=\"Y\",0,(IF(BF34=\"N\",0,(IF(M34=\"P\",AA34)))))))))))))","v":0},{"$f":"IF(N34=\"\",0,(IF(T34=\"\",0,(IF(T34=\"Y\",0,(IF(S34=\"Y\",0, (IF(R34=\"Y\",0,(IF(BF34=\"N\",0,(IF(N34=\"P\",AA34)))))))))))))","v":0},{"$f":"IF(M34=\"\",0,(IF(T34=\"\",0,(IF(T34=\"N\",0,(IF(S34=\"Y\",0,(IF(BF34=\"N\",0,(IF(T34=\"Y\",(X34))))))))))))","v":0},{"$f":"IF(M34=\"\",0,(IF(T34=\"\",0,(IF(T34=\"Y\",0,(IF(S34=\"N\",0,(IF(BF34=\"N\",0,(IF(M34=\"P\",AA34)))))))))))","v":0},{"$f":"IF(N34=\"\",0,(IF(T34=\"\",0,(IF(T34=\"Y\",0,(IF(S34=\"N\",0, (IF(BF34=\"N\",0,(IF(N34=\"P\",AA34)))))))))))","v":0},{"$f":"IF(M34=\"\",0,(IF(T34=\"\",0,(IF(S34=\"N\",0,(IF(BF34=\"N\",0,(IF(T34=\"N\",0,(IF(T34=\"Y\",U34)))))))))))","v":0},{"$f":"IF(M34=\"\",0,(IF(T34=\"\",0,(IF(T34=\"Y\",0,(IF(S34=\"Y\",0,(IF(R34=\"N\",0,(IF(BF34=\"N\",0,(IF(M34=\"P\",AA34)))))))))))))","v":0},{"$f":"IF(N34=\"\",0,(IF(T34=\"\",0,(IF(T34=\"Y\",0,(IF(R34=\"N\",0, (IF(BF34=\"N\",0,(IF(N34=\"P\",AA34)))))))))))","v":0},{"$f":"IF(M34=\"\",0,(IF(BC34=\"N\",0,(IF(BD34=\"Y\",0,(IF(T34=\"Y\",0,(IF(BC34=\"E\",AA34,(IF(BC34=\"D\",AA34,(IF(BC34=\"O\",AA34,(IF(BC34=\"M\",AA34)))))))))))))))","v":0},{"$f":"IF(N34=\"\",0,(IF(BH34>0,0,(IF(BC34=\"N\",0,(IF(BD34=\"Y\",0,(IF(T34=\"Y\",0,(IF(BC34=\"E\",AA34,(IF(BC34=\"D\",AA34,(IF(BC34=\"O\",AA34,(IF(BC34=\"M\",AA34)))))))))))))))))","v":0},{"$f":"IF(M34=\"\",0,(IF(U34=\"\",0,(IF(BC34=\"N\",0,(IF(BD34=\"Y\",0,IF(T34=\"N\",0,(IF(BC34=\"E\",U34,(IF(BC34=\"D\",U34,(IF(BC34=\"O\",U34,(IF(BC34=\"M\",U34))))))))))))))))","v":0},{"$f":"(IF(M34=\"\",0,(IF(AA34=\"\",0,(IF(BE34=\"N\",0,(IF(BF34=\"Y\",0,(IF(R34=\"Y\",0,(IF(BH34>0,0,(IF(T34=\"Y\",0,(IF(BE34=\"Y\",AA34))))))))))))))))","v":0},{"$f":"IF(N34=\"\",0,(IF(AA34=\"\",0,(IF(BE34=\"N\",0,(IF(BF34=\"Y\",0,(IF(BH34>0,0,(IF(R34=\"Y\",0,(IF(T34=\"Y\",0,(IF(BE34=\"Y\",AA34)))))))))))))))","v":0},{"$f":"IF(M34=\"\",0,(IF(U34=\"\",0,(IF(T34=\"N\",0,(IF(BE34=\"N\",0,(IF(BF34=\"Y\",0,(IF(BE34=\"Y\",U34)))))))))))","v":0},{"$f":"IF(M34=\"\",0,(IF(T34=\"\",0,(IF(T34=\"Y\",0,(IF(S34=\"Y\",0,(IF(R34=\"N\",0,(IF(BD34=\"Y\",0,(IF(BF34=\"Y\",0,(IF(M34=\"P\",AA34)))))))))))))))","v":0},{"$f":"IF(N34=\"\",0,(IF(T34=\"\",0,(IF(T34=\"Y\",0,(IF(R34=\"N\",0, (IF(BF34=\"Y\",0,(IF(BE34=\"N\",0,(IF(N34=\"P\",AA34)))))))))))))","v":0},{"$f":"IF(M34=\"\",0,(IF(T34=\"Y\",0,(IF(BG34=\"Y\",0,(IF(BD34=\"N\",0,(IF(R34=\"Y\",0,(IF(BD34=\"Y\",AA34)))))))))))","v":0},{"$f":"IF(N34=\"\",0,(IF(BD34=\"\",0,(IF(BD34=\"N\",0,(IF(BH34>0,0,(IF(T34=\"Y\",0,(IF(R34=\"Y\",0,(IF(BD34=\"Y\",AA34)))))))))))))","v":0},{"$f":"IF(M34=\"\",0,(IF(BD34=\"\",0,(IF(BD34=\"N\",0,(IF(T34=\"N\",0,(IF(Q34=\"Y\",0,(IF(BD34=\"Y\",U34)))))))))))","v":0},{"$f":"IF(M34=\"\",0,(IF(T34=\"\",0,(IF(T34=\"Y\",0,(IF(S34=\"Y\",0,(IF(R34=\"N\",0,(IF(BE34=\"Y\",0,(IF(M34=\"P\",AA34)))))))))))))","v":0},{"$f":"IF(N34=\"\",0,(IF(T34=\"\",0,(IF(T34=\"Y\",0,(IF(R34=\"N\",0, (IF(BE34=\"Y\",0,(IF(BD34=\"N\",0,(IF(N34=\"P\",AA34)))))))))))))","v":0},{"$f":"IF(M34=\"\",0,(IF(BF34=\"Y\",0,(IF(BH34=\"\",0,(IF(BG34=\"N\",0,(IF(BH34=\"R\",0,(IF(BH34=\"S\",AA34)))))))))))","v":0},0,{"$f":"IF(N34=\"\",0,(IF(BF34=\"Y\",0,(IF(BG34=\"N\",0,(IF(BH34=\"R\",0,(IF(BH34=\"S\",AA34)))))))))","v":0},{"$f":"IF(M34=\"\",0,(IF(BF34=\"Y\",0,(IF(BG34=\"N\",0,(IF(BH34=\"\",0,(IF(BH34=\"S\",0,(IF(BH34=\"R\",AA34)))))))))))","v":0},0,{"$f":"IF(N34=\"\",0,(IF(BF34=\"Y\",0,(IF(BG34=\"N\",0,(IF(BH34=\"S\",0,(IF(BH34=\"R\",AA34)))))))))","v":0},null,null,null,null,null,null,null,null,null,null,null,null,null,null,null,null,null,null,"",null,null,null,"","",null,"",null,"",null,"",null,"","","","",{"$f":"IF(CI34=\"\",\"\",((IF($CI34<20,4*$CI34/550,(IF($CI34<29.1,6*$CI34/550,(IF($CI34<40.1,8*$CI34/550,(IF($CI34<60.1,10*$CI34/550,12*$CI34/550))))))))*AA34))","v":""},{"$f":"IF(BF34=\"\",\"\",(IF(BF34=\"N\",\"\",(IF(T34=\"Y\",\"Y\",(IF(AA34=\"\",\"Y\",(IF(AA34=0,\"\",(IF(BF34=\"Y\",(AB34+AC34+AE34+AF34+AH34+AI34))))))))))))","v":""},{"$f":"IF(BG34=\"\",\"\",(IF(BG34=\"N\",\"\",(IF(BF34=\"Y\",\"\",(IF(Q34=\"Y\",\"\",(IF(BG34=\"Y\",(AW34+AY34+AZ34+BB34))))))))))","v":""},{"$f":"IF(Q34=\"Y\",\"\",(IF(BF34=\"Y\",\"\",(IF(BG34=\"Y\",\"\",(IF(T34=\"Y\",\"Y\",(IF(AA34=\"\",\"\",(IF(AJ34>0,BI34,(IF(AK34>0,BI34,(AM34+AN34+AR34+AS34+AU34+AV34))))))))))))))","v":""},{"$f":"(IF(AA34=\"\",\"\",(IF(M34=\"\",\"\",(IF(Q34=\"Y\",\"\",(IF(BG34=\"N\",\"\",(IF(BF34=\"Y\",\"\",(IF(BG34=\"Y\",(AX34+BA34)))))))))))))","v":""},"",{"$f":"IF(AA34=\"\",\"\",(IF(Q34=\"Y\",\"\",(IF(AR34=0,\"\",(AR34))))))","v":""},"","","","",{"$f":"IF(BN34=\"\",\"\",(IF(S34=\"Y\",\"\",(IF(R34=\"Y\",\"\",(IF(Q34=\"Y\",\"\",(IF(T34=\"Y\",\"\",(IF(BF34=\"\",\"\",(IF(BF34=\"N\",\"\",(CL34))))))))))))))","v":""},{"$f":"IF(BF34=\"\",\"\",(IF(BF34=\"N\",\"\",(IF(BP34=\"\",\"\",(IF(R34=\"Y\",\"\",(IF(T34=\"Y\",\"\",(IF($CY$6=\"\",\"\",(IF(AA34=\"\",\"\",(PI()*((BP34/2)*(BP34/2)))/10000*AA34)))))))))))))","v":""}]
[null,null,null,"yyyyy","MAJOR PRUNING\n(Scattered Trees Only)"]
[null,null,null,null,null,null,null,null,null,null,null,null,null,null,null,null,null,null,null,null,null,{"$f":"IF(BF36=\"\",\"\",(IF(U36=\"\",\"\",(IF(BF36=\"N\",\"\",(IF(BF36=\"Y\",U36)))))))","v":""},null,{"$f":"IF(V36=\"\",\"\",(IF(BF36=\"N\",\"\",((V36*W36)/10000))))","v":""},null,null,null,{"$f":"IF(M36=\"\",0,(IF(T36=\"\",0,(IF(T36=\"Y\",0,(IF(S36=\"Y\",0, (IF(R36=\"Y\",0,(IF(BF36=\"N\",0,(IF(M36=\"P\",AA36)))))))))))))","v":0},{"$f":"IF(N36=\"\",0,(IF(T36=\"\",0,(IF(T36=\"Y\",0,(IF(S36=\"Y\",0, (IF(R36=\"Y\",0,(IF(BF36=\"N\",0,(IF(N36=\"P\",AA36)))))))))))))","v":0},{"$f":"IF(M36=\"\",0,(IF(T36=\"\",0,(IF(T36=\"N\",0,(IF(S36=\"Y\",0,(IF(BF36=\"N\",0,(IF(T36=\"Y\",(X36))))))))))))","v":0},{"$f":"IF(M36=\"\",0,(IF(T36=\"\",0,(IF(T36=\"Y\",0,(IF(S36=\"N\",0,(IF(BF36=\"N\",0,(IF(M36=\"P\",AA36)))))))))))","v":0},{"$f":"IF(N36=\"\",0,(IF(T36=\"\",0,(IF(T36=\"Y\",0,(IF(S36=\"N\",0, (IF(BF36=\"N\",0,(IF(N36=\"P\",AA36)))))))))))","v":0},{"$f":"IF(M36=\"\",0,(IF(T36=\"\",0,(IF(S36=\"N\",0,(IF(BF36=\"N\",0,(IF(T36=\"N\",0,(IF(T36=\"Y\",U36)))))))))))","v":0},{"$f":"IF(M36=\"\",0,(IF(T36=\"\",0,(IF(T36=\"Y\",0,(IF(S36=\"Y\",0,(IF(R36=\"N\",0,(IF(BF36=\"N\",0,(IF(M36=\"P\",AA36)))))))))))))","v":0},{"$f":"IF(N36=\"\",0,(IF(T36=\"\",0,(IF(T36=\"Y\",0,(IF(R36=\"N\",0, (IF(BF36=\"N\",0,(IF(N36=\"P\",AA36)))))))))))","v":0},{"$f":"IF(M36=\"\",0,(IF(BC36=\"N\",0,(IF(BD36=\"Y\",0,(IF(T36=\"Y\",0,(IF(BC36=\"E\",AA36,(IF(BC36=\"D\",AA36,(IF(BC36=\"O\",AA36,(IF(BC36=\"M\",AA36)))))))))))))))","v":0},{"$f":"IF(N36=\"\",0,(IF(BH36>0,0,(IF(BC36=\"N\",0,(IF(BD36=\"Y\",0,(IF(T36=\"Y\",0,(IF(BC36=\"E\",AA36,(IF(BC36=\"D\",AA36,(IF(BC36=\"O\",AA36,(IF(BC36=\"M\",AA36)))))))))))))))))","v":0},{"$f":"IF(M36=\"\",0,(IF(U36=\"\",0,(IF(BC36=\"N\",0,(IF(BD36=\"Y\",0,IF(T36=\"N\",0,(IF(BC36=\"E\",U36,(IF(BC36=\"D\",U36,(IF(BC36=\"O\",U36,(IF(BC36=\"M\",U36))))))))))))))))","v":0},{"$f":"(IF(M36=\"\",0,(IF(AA36=\"\",0,(IF(BE36=\"N\",0,(IF(BF36=\"Y\",0,(IF(R36=\"Y\",0,(IF(BH36>0,0,(IF(T36=\"Y\",0,(IF(BE36=\"Y\",AA36))))))))))))))))","v":0},{"$f":"IF(N36=\"\",0,(IF(AA36=\"\",0,(IF(BE36=\"N\",0,(IF(BF36=\"Y\",0,(IF(BH36>0,0,(IF(R36=\"Y\",0,(IF(T36=\"Y\",0,(IF(BE36=\"Y\",AA36)))))))))))))))","v":0},{"$f":"IF(M36=\"\",0,(IF(U36=\"\",0,(IF(T36=\"N\",0,(IF(BE36=\"N\",0,(IF(BF36=\"Y\",0,(IF(BE36=\"Y\",U36)))))))))))","v":0},{"$f":"IF(M36=\"\",0,(IF(T36=\"\",0,(IF(T36=\"Y\",0,(IF(S36=\"Y\",0,(IF(R36=\"N\",0,(IF(BD36=\"Y\",0,(IF(BF36=\"Y\",0,(IF(M36=\"P\",AA36)))))))))))))))","v":0},{"$f":"IF(N36=\"\",0,(IF(T36=\"\",0,(IF(T36=\"Y\",0,(IF(R36=\"N\",0, (IF(BF36=\"Y\",0,(IF(BE36=\"N\",0,(IF(N36=\"P\",AA36)))))))))))))","v":0},{"$f":"IF(M36=\"\",0,(IF(T36=\"Y\",0,(IF(BG36=\"Y\",0,(IF(BD36=\"N\",0,(IF(R36=\"Y\",0,(IF(BD36=\"Y\",AA36)))))))))))","v":0},{"$f":"IF(N36=\"\",0,(IF(BD36=\"\",0,(IF(BD36=\"N\",0,(IF(BH36>0,0,(IF(T36=\"Y\",0,(IF(R36=\"Y\",0,(IF(BD36=\"Y\",AA36)))))))))))))","v":0},{"$f":"IF(M36=\"\",0,(IF(BD36=\"\",0,(IF(BD36=\"N\",0,(IF(T36=\"N\",0,(IF(Q36=\"Y\",0,(IF(BD36=\"Y\",U36)))))))))))","v":0},{"$f":"IF(M36=\"\",0,(IF(T36=\"\",0,(IF(T36=\"Y\",0,(IF(S36=\"Y\",0,(IF(R36=\"N\",0,(IF(BE36=\"Y\",0,(IF(M36=\"P\",AA36)))))))))))))","v":0},{"$f":"IF(N36=\"\",0,(IF(T36=\"\",0,(IF(T36=\"Y\",0,(IF(R36=\"N\",0, (IF(BE36=\"Y\",0,(IF(BD36=\"N\",0,(IF(N36=\"P\",AA36)))))))))))))","v":0},{"$f":"IF(M36=\"\",0,(IF(BF36=\"Y\",0,(IF(BH36=\"\",0,(IF(BG36=\"N\",0,(IF(BH36=\"R\",0,(IF(BH36=\"S\",AA36)))))))))))","v":0},{"$f":"(IF(AW36=0,0,AW36))*3","v":0},{"$f":"IF(N36=\"\",0,(IF(BF36=\"Y\",0,(IF(BG36=\"N\",0,(IF(BH36=\"R\",0,(IF(BH36=\"S\",AA36)))))))))","v":0},{"$f":"IF(M36=\"\",0,(IF(BF36=\"Y\",0,(IF(BG36=\"N\",0,(IF(BH36=\"\",0,(IF(BH36=\"S\",0,(IF(BH36=\"R\",AA36)))))))))))","v":0},{"$f":"(IF(AZ36=0,0,AZ36))*2","v":0},{"$f":"IF(N36=\"\",0,(IF(BF36=\"Y\",0,(IF(BG36=\"N\",0,(IF(BH36=\"S\",0,(IF(BH36=\"R\",AA36)))))))))","v":0},null,null,null,null,null,null,null,null,null,null,null,null,null,null,null,null,null,null,{"$f":"(IF(BT36=\"\",\"\",((BT36*50)^0.42)*0.64))","v":""},null,null,null,{"$f":"IF(BF36=\"\",\"\",(IF(BF36=\"N\",\"\",(IF(BF36=\"Y\",(IF(BN36=\"\",\"\",(IF($BN36<10,1,(IF($BN36<20,2,3))))*1.05)))))))","v":""},{"$f":"IF(BV36=\"\",\"\",(IF(BF36=\"N\",\"\",(IF(BF36=\"Y\",((100-$BV36)*0.04)+2)))))","v":""},null,{"$f":"IF(CA36=\"\",\"\",(IF(BF36=\"N\",\"\",(IF(BF36=\"Y\",(CA36*1.45))))))","v":""},null,{"$f":"IF(CC36=\"\",\"\",(IF(BF36=\"N\",\"\",(IF(BF36=\"Y\",(CC36*0.65))))))","v":""},null,{"$f":"IF(CE36=\"\",\"\",(IF(BF36=\"N\",\"\",(IF(BF36=\"Y\",(CE36*0.4))))))","v":""},null,{"$f":"IF(CG36=\"\",\"\",(IF(BF36=\"N\",\"\",(IF(BF36=\"Y\",(CG36*0.35))))))","v":""},{"$f":"IF(BY36=\"\",\"\",(SUM(BY36,BZ36,CB36,CD36,CF36,CH36)*SUM(BY36,BZ36,CB36,CD36,CF36,CH36)*SUM(BY36,BZ36,CB36,CD36,CF36,CH36)/55.5))","v":""},{"$f":"IF(CI36=\"\",\"\",IF(CI36<30,0,(IF(CI36>=30,1))))","v":""},{"$f":"IF(CI36=\"\",\"\",(IF(CJ36=1,CJ36=\"@\",(IF(CJ36=0,(IF($CI36<20,4*$CI36/550,(IF($CI36<30,6*$CI36/550,(IF($CI36<41,8*$CI36/550,(IF($CI36<61,10*$CI36/550,12*$CI36/550)))))))))))))","v":""},{"$f":"IF(CI36=\"\",\"\",((IF($CI36<20,4*$CI36/550,(IF($CI36<29.1,6*$CI36/550,(IF($CI36<40.1,8*$CI36/550,(IF($CI36<60.1,10*$CI36/550,12*$CI36/550))))))))*AA36))","v":""},{"$f":"IF(BF36=\"\",\"\",(IF(BF36=\"N\",\"\",(IF(T36=\"Y\",\"Y\",(IF(AA36=\"\",\"Y\",(IF(AA36=0,\"\",(IF(BF36=\"Y\",(AB36+AC36+AE36+AF36+AH36+AI36))))))))))))","v":""},{"$f":"IF(BG36=\"\",\"\",(IF(BG36=\"N\",\"\",(IF(BF36=\"Y\",\"\",(IF(Q36=\"Y\",\"\",(IF(BG36=\"Y\",(AW36+AY36+AZ36+BB36))))))))))","v":""},{"$f":"IF(Q36=\"Y\",\"\",(IF(BF36=\"Y\",\"\",(IF(BG36=\"Y\",\"\",(IF(T36=\"Y\",\"Y\",(IF(AA36=\"\",\"\",(IF(AJ36>0,BI36,(IF(AK36>0,BI36,(AM36+AN36+AR36+AS36+AU36+AV36))))))))))))))","v":""},{"$f":"(IF(AA36=\"\",\"\",(IF(M36=\"\",\"\",(IF(Q36=\"Y\",\"\",(IF(BG36=\"N\",\"\",(IF(BF36=\"Y\",\"\",(IF(BG36=\"Y\",(AX36+BA36)))))))))))))","v":""},{"$f":"IF(AT36=0,\"\",(IF(AQ36=\"Y\",\"\",(AT36))))","v":""},{"$f":"IF(AA36=\"\",\"\",(IF(Q36=\"Y\",\"\",(IF(AR36=0,\"\",(AR36))))))","v":""},{"$f":"IF(AM36=0,\"\",(IF(Q36=\"Y\",\"\",(AM36))))","v":""},{"$f":"IF(AM36=0,\"\",(IF(Q36=\"Y\",\"\",(AM36))))","v":""},{"$f":"(IF(AE36=0,\"\",(IF(Q36=\"Y\",\"\",(AE36*2)))))","v":""},{"$f":"IF(AD36=0,\"\",(IF(Q36=\"Y\",\"\",(AD36))))","v":""},{"$f":"IF(BN36=\"\",\"\",(IF(S36=\"Y\",\"\",(IF(R36=\"Y\",\"\",(IF(Q36=\"Y\",\"\",(IF(T36=\"Y\",\"\",(IF(BF36=\"\",\"\",(IF(BF36=\"N\",\"\",(CL36))))))))))))))","v":""},{"$f":"IF(BF36=\"\",\"\",(IF(BF36=\"N\",\"\",(IF(BP36=\"\",\"\",(IF(R36=\"Y\",\"\",(IF(T36=\"Y\",\"\",(IF($CY$6=\"\",\"\",(IF(AA36=\"\",\"\",(PI()*((BP36/2)*(BP36/2)))/10000*AA36)))))))))))))","v":""}]
[null,null,null,null,null,null,null,null,null,null,null,null,null,null,null,null,null,null,null,null,null,{"$f":"IF(BF37=\"\",\"\",(IF(U37=\"\",\"\",(IF(BF37=\"N\",\"\",(IF(BF37=\"Y\",U37)))))))","v":""},null,{"$f":"IF(V37=\"\",\"\",(IF(BF37=\"N\",\"\",((V37*W37)/10000))))","v":""},null,null,null,{"$f":"IF(M37=\"\",0,(IF(T37=\"\",0,(IF(T37=\"Y\",0,(IF(S37=\"Y\",0, (IF(R37=\"Y\",0,(IF(BF37=\"N\",0,(IF(M37=\"P\",AA37)))))))))))))","v":0},{"$f":"IF(N37=\"\",0,(IF(T37=\"\",0,(IF(T37=\"Y\",0,(IF(S37=\"Y\",0, (IF(R37=\"Y\",0,(IF(BF37=\"N\",0,(IF(N37=\"P\",AA37)))))))))))))","v":0},{"$f":"IF(M37=\"\",0,(IF(T37=\"\",0,(IF(T37=\"N\",0,(IF(S37=\"Y\",0,(IF(BF37=\"N\",0,(IF(T37=\"Y\",(X37))))))))))))","v":0},{"$f":"IF(M37=\"\",0,(IF(T37=\"\",0,(IF(T37=\"Y\",0,(IF(S37=\"N\",0,(IF(BF37=\"N\",0,(IF(M37=\"P\",AA37)))))))))))","v":0},{"$f":"IF(N37=\"\",0,(IF(T37=\"\",0,(IF(T37=\"Y\",0,(IF(S37=\"N\",0, (IF(BF37=\"N\",0,(IF(N37=\"P\",AA37)))))))))))","v":0},{"$f":"IF(M37=\"\",0,(IF(T37=\"\",0,(IF(S37=\"N\",0,(IF(BF37=\"N\",0,(IF(T37=\"N\",0,(IF(T37=\"Y\",U37)))))))))))","v":0},{"$f":"IF(M37=\"\",0,(IF(T37=\"\",0,(IF(T37=\"Y\",0,(IF(S37=\"Y\",0,(IF(R37=\"N\",0,(IF(BF37=\"N\",0,(IF(M37=\"P\",AA37)))))))))))))","v":0},{"$f":"IF(N37=\"\",0,(IF(T37=\"\",0,(IF(T37=\"Y\",0,(IF(R37=\"N\",0, (IF(BF37=\"N\",0,(IF(N37=\"P\",AA37)))))))))))","v":0},{"$f":"IF(M37=\"\",0,(IF(BC37=\"N\",0,(IF(BD37=\"Y\",0,(IF(T37=\"Y\",0,(IF(BC37=\"E\",AA37,(IF(BC37=\"D\",AA37,(IF(BC37=\"O\",AA37,(IF(BC37=\"M\",AA37)))))))))))))))","v":0},{"$f":"IF(N37=\"\",0,(IF(BH37>0,0,(IF(BC37=\"N\",0,(IF(BD37=\"Y\",0,(IF(T37=\"Y\",0,(IF(BC37=\"E\",AA37,(IF(BC37=\"D\",AA37,(IF(BC37=\"O\",AA37,(IF(BC37=\"M\",AA37)))))))))))))))))","v":0},{"$f":"IF(M37=\"\",0,(IF(U37=\"\",0,(IF(BC37=\"N\",0,(IF(BD37=\"Y\",0,IF(T37=\"N\",0,(IF(BC37=\"E\",U37,(IF(BC37=\"D\",U37,(IF(BC37=\"O\",U37,(IF(BC37=\"M\",U37))))))))))))))))","v":0},{"$f":"(IF(M37=\"\",0,(IF(AA37=\"\",0,(IF(BE37=\"N\",0,(IF(BF37=\"Y\",0,(IF(R37=\"Y\",0,(IF(BH37>0,0,(IF(T37=\"Y\",0,(IF(BE37=\"Y\",AA37))))))))))))))))","v":0},{"$f":"IF(N37=\"\",0,(IF(AA37=\"\",0,(IF(BE37=\"N\",0,(IF(BF37=\"Y\",0,(IF(BH37>0,0,(IF(R37=\"Y\",0,(IF(T37=\"Y\",0,(IF(BE37=\"Y\",AA37)))))))))))))))","v":0},{"$f":"IF(M37=\"\",0,(IF(U37=\"\",0,(IF(T37=\"N\",0,(IF(BE37=\"N\",0,(IF(BF37=\"Y\",0,(IF(BE37=\"Y\",U37)))))))))))","v":0},{"$f":"IF(M37=\"\",0,(IF(T37=\"\",0,(IF(T37=\"Y\",0,(IF(S37=\"Y\",0,(IF(R37=\"N\",0,(IF(BD37=\"Y\",0,(IF(BF37=\"Y\",0,(IF(M37=\"P\",AA37)))))))))))))))","v":0},{"$f":"IF(N37=\"\",0,(IF(T37=\"\",0,(IF(T37=\"Y\",0,(IF(R37=\"N\",0, (IF(BF37=\"Y\",0,(IF(BE37=\"N\",0,(IF(N37=\"P\",AA37)))))))))))))","v":0},{"$f":"IF(M37=\"\",0,(IF(T37=\"Y\",0,(IF(BG37=\"Y\",0,(IF(BD37=\"N\",0,(IF(R37=\"Y\",0,(IF(BD37=\"Y\",AA37)))))))))))","v":0},{"$f":"IF(N37=\"\",0,(IF(BD37=\"\",0,(IF(BD37=\"N\",0,(IF(BH37>0,0,(IF(T37=\"Y\",0,(IF(R37=\"Y\",0,(IF(BD37=\"Y\",AA37)))))))))))))","v":0},{"$f":"IF(M37=\"\",0,(IF(BD37=\"\",0,(IF(BD37=\"N\",0,(IF(T37=\"N\",0,(IF(Q37=\"Y\",0,(IF(BD37=\"Y\",U37)))))))))))","v":0},{"$f":"IF(M37=\"\",0,(IF(T37=\"\",0,(IF(T37=\"Y\",0,(IF(S37=\"Y\",0,(IF(R37=\"N\",0,(IF(BE37=\"Y\",0,(IF(M37=\"P\",AA37)))))))))))))","v":0},{"$f":"IF(N37=\"\",0,(IF(T37=\"\",0,(IF(T37=\"Y\",0,(IF(R37=\"N\",0, (IF(BE37=\"Y\",0,(IF(BD37=\"N\",0,(IF(N37=\"P\",AA37)))))))))))))","v":0},{"$f":"IF(M37=\"\",0,(IF(BF37=\"Y\",0,(IF(BH37=\"\",0,(IF(BG37=\"N\",0,(IF(BH37=\"R\",0,(IF(BH37=\"S\",AA37)))))))))))","v":0},0,{"$f":"IF(N37=\"\",0,(IF(BF37=\"Y\",0,(IF(BG37=\"N\",0,(IF(BH37=\"R\",0,(IF(BH37=\"S\",AA37)))))))))","v":0},{"$f":"IF(M37=\"\",0,(IF(BF37=\"Y\",0,(IF(BG37=\"N\",0,(IF(BH37=\"\",0,(IF(BH37=\"S\",0,(IF(BH37=\"R\",AA37)))))))))))","v":0},0,{"$f":"IF(N37=\"\",0,(IF(BF37=\"Y\",0,(IF(BG37=\"N\",0,(IF(BH37=\"S\",0,(IF(BH37=\"R\",AA37)))))))))","v":0},null,null,null,null,null,null,null,null,null,null,null,null,null,null,null,null,null,null,"",null,null,null,"","",null,"",null,"",null,"",null,"","","","",{"$f":"IF(CI37=\"\",\"\",((IF($CI37<20,4*$CI37/550,(IF($CI37<29.1,6*$CI37/550,(IF($CI37<40.1,8*$CI37/550,(IF($CI37<60.1,10*$CI37/550,12*$CI37/550))))))))*AA37))","v":""},{"$f":"IF(BF37=\"\",\"\",(IF(BF37=\"N\",\"\",(IF(T37=\"Y\",\"Y\",(IF(AA37=\"\",\"Y\",(IF(AA37=0,\"\",(IF(BF37=\"Y\",(AB37+AC37+AE37+AF37+AH37+AI37))))))))))))","v":""},{"$f":"IF(BG37=\"\",\"\",(IF(BG37=\"N\",\"\",(IF(BF37=\"Y\",\"\",(IF(Q37=\"Y\",\"\",(IF(BG37=\"Y\",(AW37+AY37+AZ37+BB37))))))))))","v":""},{"$f":"IF(Q37=\"Y\",\"\",(IF(BF37=\"Y\",\"\",(IF(BG37=\"Y\",\"\",(IF(T37=\"Y\",\"Y\",(IF(AA37=\"\",\"\",(IF(AJ37>0,BI37,(IF(AK37>0,BI37,(AM37+AN37+AR37+AS37+AU37+AV37))))))))))))))","v":""},{"$f":"(IF(AA37=\"\",\"\",(IF(M37=\"\",\"\",(IF(Q37=\"Y\",\"\",(IF(BG37=\"N\",\"\",(IF(BF37=\"Y\",\"\",(IF(BG37=\"Y\",(AX37+BA37)))))))))))))","v":""},"",{"$f":"IF(AA37=\"\",\"\",(IF(Q37=\"Y\",\"\",(IF(AR37=0,\"\",(AR37))))))","v":""},"","","","",{"$f":"IF(BN37=\"\",\"\",(IF(S37=\"Y\",\"\",(IF(R37=\"Y\",\"\",(IF(Q37=\"Y\",\"\",(IF(T37=\"Y\",\"\",(IF(BF37=\"\",\"\",(IF(BF37=\"N\",\"\",(CL37))))))))))))))","v":""},{"$f":"IF(BF37=\"\",\"\",(IF(BF37=\"N\",\"\",(IF(BP37=\"\",\"\",(IF(R37=\"Y\",\"\",(IF(T37=\"Y\",\"\",(IF($CY$6=\"\",\"\",(IF(AA37=\"\",\"\",(PI()*((BP37/2)*(BP37/2)))/10000*AA37)))))))))))))","v":""}]
[null,null,null,"qqqqq"]

{"sheet":"BlankImpact","index":11,"n_rows":41,"n_cols":110,"rows_kept":41,"cut":false,"hidden":true,"merged":[[0,42,13,42],[0,46,13,46],[0,47,13,47],[0,48,13,48],[0,53,13,53],[2,97,13,97],[3,60,4,60],[5,60,13,60],[0,69,4,69],[0,60,2,60],[0,62,13,62],[0,61,13,61],[0,49,13,49],[0,50,13,50],[0,64,13,64],[5,58,13,58],[1,58,4,58],[1,57,4,57],[1,59,13,59],[5,56,13,56],[1,56,4,56],[0,109,13,109],[2,78,13,78],[2,83,13,83],[0,103,0,105],[1,92,13,92],[2,79,13,79],[2,84,13,84],[0,90,0,92],[2,89,13,89],[11,88,12,88],[2,88,10,88],[11,101,13,102],[8,100,13,100],[2,86,13,86],[2,85,13,85],[0,93,0,100],[6,100,7,100],[1,98,1,100],[1,105,4,105],[1,106,4,106],[1,103,4,103],[1,104,4,104],[2,94,13,94],[2,95,13,95],[0,1,0,4],[0,20,13,20],[2,1,3,4],[7,1,15,1],[3,23,4,23],[0,44,13,44],[1,55,4,55],[7,0,14,0],[7,2,15,2],[9,4,9,5],[11,4,13,4],[4,1,6,4],[0,52,13,52],[0,45,13,45],[0,51,13,51],[0,39,13,39],[0,19,1,19],[2,19,13,19],[0,43,13,43],[0,26,13,26],[8,24,13,24],[8,25,13,25],[0,35,13,35],[1,54,13,54],[7,4,7,5],[0,22,13,22],[8,4,8,5],[0,17,1,17],[2,17,13,17],[0,23,2,23],[0,6,0,11],[1,6,13,6],[1,7,13,7],[1,8,13,8],[1,9,13,9],[1,11,13,11],[0,12,8,15],[9,12,13,12],[9,13,13,13],[9,14,13,14],[5,23,13,23],[1,10,13,10],[1,1,1,4],[9,15,13,15],[0,18,1,18],[2,18,13,18],[0,21,13,21],[0,16,1,16],[1,107,4,107],[1,108,4,108],[2,100,5,100],[1,90,13,90],[1,91,13,91],[0,68,13,68],[2,81,13,81],[2,82,13,82],[0,86,1,89],[0,70,13,70],[0,71,13,71],[0,72,13,72],[1,96,1,97],[2,99,13,99],[1,94,1,95],[2,77,13,77],[2,76,13,76],[0,106,0,108],[2,101,4,102],[2,96,13,96],[2,16,13,16],[0,40,13,40],[0,66,13,66],[0,67,13,67],[0,63,13,63],[0,101,1,102],[2,98,13,98],[2,93,13,93],[38,101,38,102],[0,30,13,30],[0,31,13,31],[0,32,13,32],[0,33,13,33],[0,34,13,34],[0,41,13,41],[0,27,13,27],[0,28,13,28],[0,29,13,29],[0,36,13,36],[0,37,13,37],[0,38,13,38],[5,55,13,55],[5,57,13,57],[2,87,13,87],[39,101,39,102],[1,73,13,73],[1,74,13,74],[1,75,13,75],[0,65,13,65],[37,101,37,102],[28,90,28,99],[36,101,36,102],[32,101,32,102],[35,101,35,102],[34,101,34,102],[33,101,33,102],[31,101,31,102],[28,101,28,102],[29,101,29,102],[30,101,30,102],[31,90,31,99],[2,80,13,80],[5,69,13,69]]}
[null,{"$f":"Main!A2","v":"DEPARTMENT OF PLANNING, TRANSPORT &  INFRASTRUCTURE"},null,null,null,null,"SAFETY",null,null,null,null,null,"IMPACT OR RECOMMENDED ACTION",null,null,null,"Y\nN","Y\nN","Y\nN","Y\nN","AREA of Vegetation to be Removed (m2) ","AREA TO BE REMOVED SUBJECT TO THE NVA","NVA SEB Multipliation Factor (Condition)",{"$f":"SUM($X30:$X31)","v":0},null,null,"NUMBER IN GROUP (Where an area has been used in lieu of individual counts, number is shown in red)","REMOVAL \nNumber of Native Veg","MAJOR PRUNE\nNumber of Native Veg","Area of Native Veg","Regulation 5(1)(lb)\nREMOVAL \nNumber of Native Veg","Regulation 5(1)(lb)\nMAJOR PRUNE\nNumber of Native Veg","Regulation 5(1)(lb)\nArea of Native Veg","STRUCTURALLY UNSOUND\nREMOVAL \nNumber of Native Veg","STRUCTURALLY UNSOUND\nMAJOR PRUNE\nNumber of Native Veg","REMOVAL\nNumber of weeds and \"others\" excluding amenity planting","MAJOR PRUNE\nNumber of weeds and \"others\" excluding amenity planting","AREA OF WEEDS EXCLUDING AMENITY","REMOVAL\nNumber - Native Vegetation Not covered by ACT","MAJOR PRUNE\nNumber - Native Vegetation Not covered by ACT","Area - Native Vegetation Not covered by ACT","STRUCTURALLY UNSOUND\nREMOVAL \nNumber - Native Vegetation Not covered by ACT","STRUCTURALLY UNSOUND\nMAJOR PRUNE\nNumber - Native Vegetation Not covered by ACT","REMOVAL\nNumber - Amenity Planting","MAJOR PRUNE\nNumber - Amenity Planting","Area - Amenity Planting","STRUCTURALLY UNSOUND\nREMOVAL \nNumber - Amenity Planting","STRUCTURALLY UNSOUND\nMAJOR PRUNE\nNumber - Amenity Planting","REMOVAL\nNumber - Regulated Significant Trees","OFF-SET\nNumber - Regulated Significant Trees","MAJOR PRUNE\nNumber - Regulated Significant Trees","REMOVAL\nNumber - Regulated Trees","OFF-SET\nNumber - Regulated Trees","MAJOR PRUNE\nNumber - Regulated Trees","A","B","C","D","E","F",{"$f":"SUM($BI$30:$BI$4950)","v":0},"SINGLE-STEMMED(S) OR  MULTI-STEMMED(MS) SPECIMEN","BUTT DIA (M). IN GROUP AND/OR MS SITUATIONS INSERT HIGHEST RANGE READING","BUTT DIA (M). ONLY USE THIS COLUMN IN A GROUP AND/OR MS SITUATION INSERT LOWEST  RANGE","CIRCUMFERENCE (M) DEVELOPMENT ACT REQUIREMENT ONLY","HEIGHT (M). IN GROUP SITUATIONS INSERT HIGHEST RANGE READING","HEIGHT  (M) . ONLY USE THIS COLUMN IN A GROUP SITUATION INSERTING LOWEST RANGE READING ","SPREAD (M). IN GROUP AND/OR MS SITUATIONS INSERT HIGHEST RANGE READING","SPREAD (M). ONLY USE THIS COLUMN IN A GROUP SITUATION INSERTING LOWEST RANGE READING ","VG\nG\nF\nP\nD","TREE PROTECTION ZONE (TPZ) - BUTT DIA. @ 1.4m x 12","TRUNK DIA. JUST ABOVE TREE BASE (m)","STRUCTURAL ROOT ZONE (SRZ) RADIUS (m)","NVA INFORMATION",null,null,null,null,null,null,null,null,null,null,null,null,"REVISION  5\nJULY 2012",null,null,null,"APPROVALS",null,null,"SET ASIDE",null,null,null,null,null,null,null,"Paying into NVC Fund Option",null,"Calculations for (NV) Scattered Tree Payment for each LGC",null,null,"Calculations for (NV) Area Payment for each LGC",null,null,"Comments"]
[null,{"$f":"Main!A3","v":"SAFETY & SERVICE DIVISION            Revision - August 2018"},null,null,null,null,"CLEARANCE ENVELOPE (S - Standard, R - Restricted)","SIDE OF ROAD (L - LEFT, R - RIGHT)","Width of the Travelway","Distance - Centreline to Edgeline","Distance of Tree from the Edgeline\n(Show in RED if behind Guardrailing)","Clearance @ Edgeline OR Edge of Envelope",null,null,null,null,null,null,null,null,null,null,null,null,null,null,null,null,null,null,null,null,null,null,null,null,null,null,null,null,null,null,null,null,null,null,null,null,null,null,null,null,null,null,"WEED SPECIES (N-no; D-declared; E-environmental)","Y\nN","Y\nN","Y\nN","Y\nN","NUMBER OF SIGNIFICANT TREES IN THE GROUP REQUIRING DAC APPROVAL",null,null,null,null,null,null,null,null,null,null,null,null,null,"%  DIEBACK","HOLLOWS (NUMBER)","HOLLOW ENTRANCE SIZE (METRES)",null,null,null,null,null,null,null,null,"VALUE",null,null,null,null,null,"NATIVE VEGETATION ACT (NVA)","DEVELOPMENT ACT (DAC)","DPTI VEGETATION REMOVAL POLICY","DAC","Amenity",null,"Native veg. not covered by NVA",null,"NVA",null,null,null,null,"Total Scattered tree SEB (ha) for each LGC","Total Canopy Area (ha) cleared for each LGC ","Payment into fund (Scattered trees) for each LGC","Total Area SEB (ha) for each LGC ","Total Area Cleared (ha) for each LGC ","Payment into fund (Area) for each LGC"]
[null,{"$f":"IF(Main!$E$4=\"\",\"\",Main!$E$4)","v":"VS 2017/???"},null,null,null,null,null,null,null,null,null,null,null,null,null,null,"Off-set is Negated","STRUCTURALLY UNSOUND TREE","REGULATION 5(1)(lb) APPLIES","Area reporting selected in lieu of individual reporting",null,null,null,null,"COLUMN \"A\"","COLUMN \"B\"",null,null,null,null,null,null,null,null,null,null,null,null,null,null,null,null,null,null,null,null,null,null,null,null,null,null,null,null,null,null,null,null,null,null,null,null,null,null,null,null,null,null,null,null,null,null,null,null,null,null,"1. HEIGHT (WEIGHTED)","2. HEALTH (WEIGHTED)","HOLLOWS 1, 2 OR 3 POINTS","3. HOLLOWS (WEIGHTED)","SUITABILITY FOR THREATENED SPECIES ","4. THREATENED SPECIES (WEIGHTED)","DENSITY","5. DENSITY  (WEIGHTED)","PROXIMITY TO OTHER VEG","6. PROXIMITY TO OTHER VEG. (WEIGHTED)","TOTAL SCORE","RECOMMENDATION","A 'FALSE' reading indicates Refusal under normal circumstances.","SEB Offset Area Requirement (total removal scattered trees)",null,null,null,"Number","Area (m2) - 1:1","Number of Plants - 1:1","Area (m2) - 2:1","Number of Plants - 2:1","Number - Regulation 5(1)(lb) Only - 2:1","Area (ha)\n(Condition Score x Area)","Total SEB amount for Area to be Removed (Ha)","LGC AVERAGE LAND VALUE "]
[null,null,null,null,null,null,null,null,null,null,null,null,null,null,null,null,null,null,null,null,null,null,null,"TOTAL",null,null,null,null,null,null,null,null,null,null,null,null,null,null,null,null,null,null,null,null,null,null,null,null,null,null,null,null,null,null,null,null,null,null,null,null,"TOTAL"]
[null,"IMPACT TABLE",null,null,null,null,null,null,null,null,null,null,null,null,null,null,null,null,null,null,null,null,null,null,{"$f":"(SUMIF($BC$29:$BC$4951,\"D\",$AA$29:$AA$4951))+(SUMIF($BC$29:$BC$4951,\"E\",$AA$29:$AA$4951))","v":0},{"$f":"(SUMIF($BD$29:$BD$4951,\"Y\",$AA$29:$AA$4951))","v":0}]
[null,null,null,null,null,null,null,null,null,null,null,null,null,null,null,null,null,null,null,null,null,null,null,"NVA SEB for AREA (HA)","COLUMN \"D\"","COLUMN \"E\"",null,null,null,null,null,null,null,null,null,null,null,null,null,null,null,null,null,null,null,null,null,null,null,null,null,null,null,null,null,"AMENITY PLANTING","NATIVE VEGETATION","SUBJECT TO NATIVE VEGETATION ACT","SUBJECT TO DEVELOPMENT ACT",null,"NO IN GROUP WITH BUTT DIA. 0.15+ OR MS 0.10+",null,null,null,null,null,null,null,null,"HEALTH & CONDITION *",null,null,null,null,null,null,null,null,null,null,null,null,null,null,null,null,null,null,null,null,null,null,null,null,null,null,null,null,null,null,null,1,null,{"$f":"IF(CY6=\"\",\"\",(SUMIF(A30:A31,\"1\",CW30:CW31)+(SUMIF(A33:A34,\"1\",CW33:CW34)/100*20)))","v":""},{"$f":"IF(CY6=\"\",\"\",(SUMIF(A30:A31,\"1\",CX30:CX31)+(SUMIF(A33:A34,\"1\",CX33:CX34))))","v":""},{"$f":"IF(CY6=\"\",\"\",(($CZ$6*$CY$6)+(800*$DA$6)))","v":""},{"$f":"IF(CY6=\"\",\"\",(SUMIF(A30:A31,\"1\",CV30:CV31)))","v":""},{"$f":"IF(CY6=\"\",\"\",(SUMIF(A30:A31,\"1\",V30:V31)/10000))","v":""},{"$f":"IF(CY6=\"\",\"\",(($DC$6*$CY$6)+(800*$DD$6)))","v":""}]
[null,null,null,null,null,null,null,null,null,null,null,null,null,null,null,null,null,null,null,null,null,null,null,null,null,null,null,null,null,null,null,null,null,null,null,null,null,null,null,null,null,null,null,null,null,null,null,null,null,null,null,null,null,null,null,null,null,null,null,null,null,null,null,null,null,null,null,null,null,null,null,null,null,null,null,null,null,null,null,null,null,null,null,null,null,null,null,null,null,null,null,null,null,null,null,null,null,null,null,null,{"$f":"X1","v":0},2,null,{"$f":"IF(CY7=\"\",\"\",(SUMIF(A30:A31,\"2\",CW30:CW31)+(SUMIF(A33:A34,\"2\",CW33:CW34)/100*20)))","v":""},{"$f":"IF(CY7=\"\",\"\",(SUMIF(A30:A31,\"2\",CX30:CX31)+(SUMIF(A33:A34,\"2\",CX33:CX34))))","v":""},{"$f":"IF(CY7=\"\",\"\",(($CZ$7*$CY$7)+(800*$DA$7)))","v":""},{"$f":"IF(CY7=\"\",\"\",(SUMIF(A30:A31,\"2\",CV30:CV31)))","v":""},{"$f":"IF(CY7=\"\",\"\",(SUMIF(A30:A31,\"2\",V30:V31)/10000))","v":""},{"$f":"IF(CY7=\"\",\"\",(($DC$7*$CY$7)+(800*$DD$7)))","v":""}]
["LGC\n(ALLOCATED NUMBER)","PLAN REFERENCE OR MM LOCATION","PHOTO REFERENCE",null,{"$f":"Main!$F$2","v":"Project Name: "},null,null,null,null,null,null,null,null,null,null,null,null,null,null,null,null,null,null,null,{"$f":"(SUMIF($BF$29:$BF$4951,\"Y\",$AA$29:$AA$4951))","v":0},{"$f":"SUMIF($BG$29:$BG$4951,\"Y\",$BH$29:$BH$4951)","v":0},null,null,null,null,null,null,null,null,null,null,null,null,null,null,null,null,null,null,null,null,null,null,null,null,null,null,null,null,null,null,null,null,null,null,null,null,null,null,null,null,null,null,null,null,null,null,null,null,null,null,null,null,null,null,null,null,null,null,null,null,null,null,null,null,null,null,null,null,null,null,null,null,null,null,{"$f":"(SUMIF(#REF!,\"Y\",CW55:CW56))/10000","v":{"$error":"#REF!"}},3,null,{"$f":"IF(CY8=\"\",\"\",(SUMIF(A30:A31,\"3\",CW30:CW31)+(SUMIF(A33:A34,\"3\",CW33:CW34)/100*20)))","v":""},{"$f":"IF(CY8=\"\",\"\",(SUMIF(A30:A31,\"3\",CX30:CX31)+(SUMIF(A33:A34,\"3\",CX33:CX34))))","v":""},{"$f":"IF(CY8=\"\",\"\",(($CZ$8*$CY$8)+(800*$DA$8)))","v":""},{"$f":"IF(CY8=\"\",\"\",(SUMIF(A30:A31,\"3\",CV30:CV31)))","v":""},{"$f":"IF(CY8=\"\",\"\",(SUMIF(A30:A31,\"3\",V30:V31)/10000))","v":""},{"$f":"IF(CY8=\"\",\"\",(($DC$8*$CY$8)+(800*$DD$8)))","v":""}]
[null,null,null,null,{"$f":"Main!$F$3","v":"Road Number : "},null,null,null,null,null,null,null,null,null,null,null,null,null,null,null,null,null,null,null,"EASTING","NORTHING",null,null,null,null,null,null,null,null,null,null,null,null,null,null,null,null,null,null,null,null,null,null,null,null,null,null,null,null,null,null,null,null,null,null,null,null,null,null,null,null,null,null,null,null,null,null,null,null,null,null,null,null,null,null,null,null,null,null,null,null,null,null,null,null,null,null,null,null,null,null,null,null,null,null,"SEB Offset Area Requirement for Scattered Trees (Ha)",4,null,{"$f":"IF(CY9=\"\",\"\",(SUMIF(A30:A31,\"4\",CW30:CW31)+(SUMIF(A33:A34,\"4\",CW33:CW34)/100*20)))","v":""},{"$f":"IF(CY9=\"\",\"\",(SUMIF(A30:A31,\"4\",CX30:CX31)+(SUMIF(A33:A34,\"4\",CX33:CX34))))","v":""},{"$f":"IF(CY9=\"\",\"\",(($CZ$9*$CY$9)+(800*$DA$9)))","v":""},{"$f":"IF(CY9=\"\",\"\",(SUMIF(A30:A31,\"4\",CV30:CV31)))","v":""},{"$f":"IF(CY9=\"\",\"\",(SUMIF(A30:A31,\"4\",V30:V31)/10000))","v":""},{"$f":"IF(CY9=\"\",\"\",(($DC$9*$CY$9)+(800*$DD$9)))","v":""}]
[null,null,null,null,{"$f":"Main!$F$4","v":"Location :"},null,null,null,null,null,null,null,"REMOVAL","MAJOR PRUNE","MINOR PRUNE","MONITOR",null,null,null,null,null,null,null,null,null,null,null,null,null,null,null,null,null,null,null,null,null,null,null,null,null,null,null,null,null,null,null,null,null,null,null,null,null,null,null,null,null,null,null,null,null,null,null,null,null,null,null,null,null,null,null,null,null,null,null,null,null,null,null,null,null,null,null,null,null,null,null,null,null,null,null,null,null,null,null,null,null,null,null,null,null,5,null,{"$f":"IF(CY10=\"\",\"\",(SUMIF(A30:A31,\"5\",CW30:CW31)+(SUMIF(A33:A34,\"5\",CW33:CW34)/100*20)))","v":""},{"$f":"IF(CY10=\"\",\"\",(SUMIF(A30:A31,\"5\",CX30:CX31)+(SUMIF(A33:A34,\"5\",CX33:CX34))))","v":""},{"$f":"IF(CY10=\"\",\"\",(($CZ$10*$CY$10)+(800*$DA$10)))","v":""},{"$f":"IF(CY10=\"\",\"\",(SUMIF(A30:A31,\"5\",CV30:CV31)))","v":""},{"$f":"IF(CY10=\"\",\"\",(SUMIF(A30:A31,\"5\",V30:V31)/10000))","v":""},{"$f":"IF(CY10=\"\",\"\",(($DC$10*$CY$10)+(800*$DD$10)))","v":""}]
[null,null,null,null,null,null,null,null,null,null,null,null,null,null,null,null,null,null,null,null,null,null,null,null,null,null,null,null,null,null,null,null,null,null,null,null,null,null,null,null,null,null,null,null,null,null,null,null,null,null,null,null,null,null,null,null,null,null,null,null,null,null,null,null,null,null,null,null,null,null,null,null,null,null,null,null,null,null,null,null,null,null,null,null,null,null,null,null,null,null,null,null,null,null,null,null,null,null,null,null,null,6,null,{"$f":"IF(CY11=\"\",\"\",(SUMIF(A30:A31,\"6\",CW30:CW31)+(SUMIF(A33:A34,\"6\",CW33:CW34)/100*20)))","v":""},{"$f":"IF(CY11=\"\",\"\",(SUMIF(A30:A31,\"6\",CX30:CX31)+(SUMIF(A33:A34,\"6\",CX33:CX34))))","v":""},{"$f":"IF(CY11=\"\",\"\",(($CZ$11*$CY$11)+(800*$DA$11)))","v":""},{"$f":"IF(CY11=\"\",\"\",(SUMIF(A30:A31,\"6\",CV30:CV31)))","v":""},{"$f":"IF(CY11=\"\",\"\",(SUMIF(A30:A31,\"6\",V30:V31)/10000))","v":""},{"$f":"IF(CY11=\"\",\"\",(($DC$11*$CY$11)+(800*$DD$11)))","v":""}]
[null,null,null,null,"Date : ???",null,null,null,null,null,null,null,null,null,null,null,null,null,null,null,null,null,null,null,null,null,null,null,null,null,null,null,null,null,null,null,null,null,null,null,null,null,null,null,null,null,null,null,null,null,null,null,null,null,null,null,null,null,null,null,null,null,null,null,null,null,null,null,null,null,null,null,null,null,null,null,null,null,null,null,null,null,null,null,null,null,null,null,"Number \"False\"",null,null,null,null,null,null,null,null,null,null,null,null,"CANOPY AREAS (SCATTERED TREES)",null,{"$f":"SUM(CZ5:CZ11)","v":0},0,0,0,0,0]
[]
[null,null,null,null,null,null,null,null,null,null,null,null,null,null,null,null,null,null,null,null,null,null,null,null,null,null,null,null,null,null,null,null,null,null,null,null,null,null,null,null,null,null,null,null,null,null,null,null,null,null,null,null,null,null,null,null,null,null,null,null,null,null,null,null,null,null,null,null,null,null,null,null,null,null,null,null,null,null,null,null,null,null,null,null,null,null,null,null,{"$f":"SUMIF(CK16:CK4891,\"FALSE\",AA16:AA4891)","v":0}]
[null,null,null,null,null,null,null,null,null,null,null,null,0.9]
[null,null,null,null,null,null,null,null,null,null,null,null,null,null,null,null,null,null,null,null,null,null,null,null,null,null,null,null,null,null,null,null,null,null,null,null,null,null,null,null,null,null,null,null,null,null,null,null,null,null,null,null,null,null,null,null,null,null,null,null,null,null,null,null,null,null,null,null,null,null,null,null,null,null,null,null,null,null,null,null,null,"F",null,"MV"]
[null,null,null,null,null,null,null,null,null,null,null,null,null,null,null,null,null,null,null,null,null,"Native Veg     Removals",null,null,null,null,{"$f":"SUM(AB30:AB31)","v":0},null,null,null,"TOTAL 5(1)(lb) Removals",{"$f":"SUM(AE30:AE31)","v":0},null,{"$f":"SUM(AH30:AH31)","v":0},"TOTAL - Removals - Structurally Unsound/Clearance Envelope -  NVA",null,null,null,null,null,null,null,null,null,null,null,null,null,null,null,null,null,"TOTAL DAC Removal - Regulated Trees",{"$f":"SUM(AZ30:AZ31)","v":0},null,null,null,null,null,null,null,null,null,null,null,null,null,null,null,null,null,null,null,null,null,null,null,null,null,null,null,null,null,null,null,null,null,null,null,null,null,null,null,null,null,null,null,null,null,null,{"$f":"CW32","v":0}]
[null,null,null,null,null,null,null,null,null,null,null,null,null,null,null,null,null,null,null,null,null,"Major Prune",null,null,null,null,{"$f":"SUM(AC33:AC34)","v":0},null,null,null,"TOTAL 5(1)(lb) Major Prune",{"$f":"SUM(AF33:AF34)","v":0},null,{"$f":"SUM(AI33:AI34)","v":0},"TOTAL - Major Prunes - Structurally Structurally Unsound/Clearance Envelope -  NVA",null,null,null,null,null,null,null,null,null,null,null,null,null,null,null,null,null,"TOTAL DAC Major Prune - Regulated Trees",{"$f":"SUM(BB33:BB34)","v":0}]
[null,null,null,null,null,null,null,null,null,null,null,null,null,null,null,null,null,null,null,null,null,"Area",null,null,null,null,{"$f":"SUM(V30:V31)/10000","v":0},null,null,null,"TOTAL 5(1)(lb) Area",{"$f":"SUM(AG33:AG34)","v":0},null,null,null,null,null,null,null,null,null,null,null,null,null,null,null,null,null,null,null,null,"TOTAL DAC Removal - Regulated Significant Trees",{"$f":"SUM(AW30:AW31)","v":0}]
[null,null,null,null,null,null,null,null,null,null,null,null,null,null,null,null,null,null,null,null,null,"Environmental Weeds     Removals","Number requiring approval",null,null,null,{"$f":"SUMIF(AJ30:AJ31,\">0\",BI30:BI31)","v":0},{"$f":"(SUMIF(AJ30:AJ31,\">0\",AA30:AA31))-(SUMIF(AJ30:AJ31,\">0\",BI30:BI31))","v":0},"Undersize Removals (no approval)",null,null,null,null,null,null,null,null,null,null,null,null,null,null,null,null,null,null,null,null,null,null,null,"TOTAL DAC Major Prune - Regulated Significant Trees",{"$f":"SUM(AY33:AY34)","v":0}]
[null,null,null,null,null,null,null,null,null,null,null,null,null,null,null,null,null,null,null,null,null,"Major Prune","Number requiring approval",null,null,null,{"$f":"SUMIF(AK33:AK34,\">0\",BI33:BI34)","v":0},{"$f":"(SUMIF(AK33:AK34,\">0\",AA33:AA34))-(SUMIF(AK33:AK34,\">0\",BI33:BI34))","v":0},"Undersize Major Prunes (no approval)"]
[null,null,null,null,null,null,null,null,null,null,null,null,null,null,null,null,null,null,null,null,null,"Area",null,null,null,null,{"$f":"SUM(AL30:AL31)","v":0},null,null,null,null,null,null,null,null,null,null,null,null,null,null,null,null,null,null,null,null,null,null,null,null,null,"TOTAL DAC Offset - Regulated  Significant Trees",{"$f":"SUM(AX30:AX31)","v":0}]
[null,null,null,null,null,null,null,null,null,null,null,null,null,null,null,null,null,null,null,null,null,"Amenity     Removals",null,null,null,null,{"$f":"SUM(AR30:AR31)","v":0},null,null,null,null,null,null,{"$f":"SUM(AU30:AU31)","v":0},"TOTAL - Removals - Structurally Unsound - Amenity",null,null,null,null,null,null,null,null,null,null,null,null,null,null,null,null,null,"TOTAL DAC Offset - Regulated Trees",{"$f":"SUM(BA30:BA31)","v":0}]
[null,null,null,null,null,null,null,null,null,null,null,null,null,null,null,null,null,null,null,null,null,"Major Prune",null,null,null,null,{"$f":"SUM(AS33:AS34)","v":0},null,null,null,null,null,null,{"$f":"SUM(AV33:AV34)","v":0},"TOTAL - Major Prunes - Structurally Unsound -Amenity"]
[null,null,null,null,null,null,null,null,null,null,null,null,null,null,null,null,null,null,null,null,null,"Area",null,null,null,null,{"$f":"SUM(AT30:AT31)","v":0}]
[null,null,null,null,null,null,null,null,null,null,null,null,null,null,null,null,null,null,null,null,null,"Native veg not covered by Act     Removals",null,null,null,null,{"$f":"SUM(AM30:AM31)","v":0},null,null,null,null,null,null,{"$f":"SUM(AP30:AP31)","v":0},"TOTAL - Removals - Structurally Unsound native veg not covered by NVA",null,null,null,null,null,null,null,null,null,null,null,null,null,null,null,null,null,"TOTAL Trees to be Monitored",{"$f":"SUM(AA39:AA40)","v":0}]
[null,null,null,null,null,null,null,null,null,null,null,null,null,null,null,null,null,null,null,null,null,"Major Prune",null,null,null,null,{"$f":"SUM(AN33:AN34)","v":0},null,null,null,null,null,null,{"$f":"SUM(AQ33:AQ34)","v":0},"TOTAL - Major Prunes - Structurally Unsound native veg not covered by NVA"]
[null,null,null,null,null,null,null,null,null,null,null,null,null,null,null,null,null,null,null,null,null,"Area",null,null,null,null,{"$f":"SUM(AO30:AO31)","v":0}]
[null,null,null,"jjjjj","REMOVALS",null,null,null,null,null,null,null,null,null,null,null,null,null,null,null,null,null,null,null,null,null,null,null,null,null,null,null,null,null,null,null,null,null,null,null,null,null,null,null,null,null,null,null,null,null,null,null,null,null,null,null,null,null,null,null,null,null,null,null,null,null,null,null,null,null,null,null,null,null,null,null,null,null,null,null,null,null,null,null,null,null,null,null,null,null,"Combined SEB for Removals\n(NVA Scattered Tree Scores)",null,null,null,null,null,null,null,null,null,{"$f":"SUM(CW30:CW31)","v":0}]
[null,null,null,null,null,null,null,null,null,null,null,null,null,null,null,null,null,null,null,null,null,{"$f":"IF(BF30=\"\",\"\",(IF(U30=\"\",\"\",(IF(BF30=\"N\",\"\",(IF(BF30=\"Y\",U30)))))))","v":""},null,{"$f":"IF(V30=\"\",\"\",(IF(BF30=\"N\",\"\",((V30*W30)/10000))))","v":""},null,null,null,{"$f":"IF(M30=\"\",0,(IF(T30=\"\",0,(IF(T30=\"Y\",0,(IF(S30=\"Y\",0, (IF(R30=\"Y\",0,(IF(BF30=\"N\",0,(IF(M30=\"P\",AA30)))))))))))))","v":0},{"$f":"IF(N30=\"\",0,(IF(T30=\"\",0,(IF(T30=\"Y\",0,(IF(S30=\"Y\",0, (IF(R30=\"Y\",0,(IF(BF30=\"N\",0,(IF(N30=\"P\",AA30)))))))))))))","v":0},{"$f":"IF(M30=\"\",0,(IF(T30=\"\",0,(IF(T30=\"N\",0,(IF(S30=\"Y\",0,(IF(BF30=\"N\",0,(IF(T30=\"Y\",(X30))))))))))))","v":0},{"$f":"IF(M30=\"\",0,(IF(T30=\"\",0,(IF(T30=\"Y\",0,(IF(S30=\"N\",0,(IF(BF30=\"N\",0,(IF(M30=\"P\",AA30)))))))))))","v":0},{"$f":"IF(N30=\"\",0,(IF(T30=\"\",0,(IF(T30=\"Y\",0,(IF(S30=\"N\",0, (IF(BF30=\"N\",0,(IF(N30=\"P\",AA30)))))))))))","v":0},{"$f":"IF(M30=\"\",0,(IF(T30=\"\",0,(IF(S30=\"N\",0,(IF(BF30=\"N\",0,(IF(T30=\"N\",0,(IF(T30=\"Y\",U30)))))))))))","v":0},{"$f":"IF(M30=\"\",0,(IF(T30=\"\",0,(IF(T30=\"Y\",0,(IF(S30=\"Y\",0,(IF(R30=\"N\",0,(IF(BF30=\"N\",0,(IF(M30=\"P\",AA30)))))))))))))","v":0},{"$f":"IF(N30=\"\",0,(IF(T30=\"\",0,(IF(T30=\"Y\",0,(IF(R30=\"N\",0, (IF(BF30=\"N\",0,(IF(N30=\"P\",AA30)))))))))))","v":0},{"$f":"IF(M30=\"\",0,(IF(BC30=\"N\",0,(IF(BD30=\"Y\",0,(IF(T30=\"Y\",0,(IF(BC30=\"E\",AA30,(IF(BC30=\"D\",AA30,(IF(BC30=\"O\",AA30,(IF(BC30=\"M\",AA30)))))))))))))))","v":0},{"$f":"IF(N30=\"\",0,(IF(BH30>0,0,(IF(BC30=\"N\",0,(IF(BD30=\"Y\",0,(IF(T30=\"Y\",0,(IF(BC30=\"E\",AA30,(IF(BC30=\"D\",AA30,(IF(BC30=\"O\",AA30,(IF(BC30=\"M\",AA30)))))))))))))))))","v":0},{"$f":"IF(M30=\"\",0,(IF(U30=\"\",0,(IF(BC30=\"N\",0,(IF(BD30=\"Y\",0,IF(T30=\"N\",0,(IF(BC30=\"E\",U30,(IF(BC30=\"D\",U30,(IF(BC30=\"O\",U30,(IF(BC30=\"M\",U30))))))))))))))))","v":0},{"$f":"(IF(M30=\"\",0,(IF(BE30=\"N\",0,(IF(BF30=\"Y\",0,(IF(Q30=\"Y\",0,(IF(R30=\"Y\",0,(IF(T30=\"Y\",0,(IF(BE30=\"Y\",AA30))))))))))))))","v":0},{"$f":"IF(N30=\"\",0,(IF(AA30=\"\",0,(IF(BE30=\"N\",0,(IF(BF30=\"Y\",0,(IF(BH30>0,0,(IF(R30=\"Y\",0,(IF(T30=\"Y\",0,(IF(BE30=\"Y\",AA30)))))))))))))))","v":0},{"$f":"IF(M30=\"\",0,(IF(U30=\"\",0,(IF(T30=\"N\",0,(IF(BE30=\"N\",0,(IF(BF30=\"Y\",0,(IF(BE30=\"Y\",U30)))))))))))","v":0},{"$f":"(IF(M30=\"\",0,(IF(T30=\"Y\",0,(IF(S30=\"Y\",0,(IF(BD30=\"Y\",0,(IF(BF30=\"Y\",0,(IF(R30=\"N\",0,(IF(M30=\"P\",AA30))))))))))))))+(IF(M30=\"\",0,(IF(R30=\"Y\",0,(IF(T30=\"Y\",0,(IF(S30=\"Y\",0,(IF(BD30=\"Y\",0,(IF(BF30=\"Y\",0,(IF(Q30=\"Y\",AA30))))))))))))))","v":0},{"$f":"IF(N30=\"\",0,(IF(T30=\"\",0,(IF(T30=\"Y\",0,(IF(R30=\"N\",0, (IF(BF30=\"Y\",0,(IF(BE30=\"N\",0,(IF(N30=\"P\",AA30)))))))))))))","v":0},{"$f":"(IF(M30=\"\",0,(IF(T30=\"Y\",0,(IF(BG30=\"Y\",0,(IF(BD30=\"N\",0,(IF(Q30=\"Y\",0,(IF(R30=\"Y\",0,(IF(BD30=\"Y\",AA30))))))))))))))","v":0},{"$f":"IF(N30=\"\",0,(IF(BD30=\"\",0,(IF(BD30=\"N\",0,(IF(BH30>0,0,(IF(T30=\"Y\",0,(IF(R30=\"Y\",0,(IF(BD30=\"Y\",AA30)))))))))))))","v":0},{"$f":"IF(M30=\"\",0,(IF(BD30=\"\",0,(IF(BD30=\"N\",0,(IF(T30=\"N\",0,(IF(Q30=\"Y\",0,(IF(BD30=\"Y\",U30)))))))))))","v":0},{"$f":"(IF(M30=\"\",0,(IF(T30=\"\",0,(IF(T30=\"Y\",0,(IF(S30=\"Y\",0,(IF(R30=\"N\",0,(IF(BE30=\"Y\",0,(IF(M30=\"P\",AA30))))))))))))))+(IF(R30=\"Y\",0,(IF(M30=\"\",0,(IF(T30=\"\",0,(IF(T30=\"Y\",0,(IF(S30=\"Y\",0,(IF(BE30=\"Y\",0,(IF(Q30=\"Y\",AA30))))))))))))))","v":0},{"$f":"IF(N30=\"\",0,(IF(T30=\"\",0,(IF(T30=\"Y\",0,(IF(R30=\"N\",0, (IF(BE30=\"Y\",0,(IF(BD30=\"N\",0,(IF(N30=\"P\",AA30)))))))))))))","v":0},{"$f":"IF(M30=\"\",0,(IF(BF30=\"Y\",0,(IF(BH30=\"\",0,(IF(BG30=\"N\",0,(IF(BH30=\"R\",0,(IF(BH30=\"S\",AA30)))))))))))","v":0},{"$f":"(IF(AW30=0,0,AW30))*3","v":0},{"$f":"IF(N30=\"\",0,(IF(BF30=\"Y\",0,(IF(BG30=\"N\",0,(IF(BH30=\"R\",0,(IF(BH30=\"S\",AA30)))))))))","v":0},{"$f":"IF(M30=\"\",0,(IF(BF30=\"Y\",0,(IF(BG30=\"N\",0,(IF(BH30=\"\",0,(IF(BH30=\"S\",0,(IF(BH30=\"R\",AA30)))))))))))","v":0},{"$f":"(IF(AZ30=0,0,AZ30))*2","v":0},{"$f":"IF(N30=\"\",0,(IF(BF30=\"Y\",0,(IF(BG30=\"N\",0,(IF(BH30=\"S\",0,(IF(BH30=\"R\",AA30)))))))))","v":0},null,null,null,null,null,null,null,null,null,null,null,null,null,null,null,null,null,null,{"$f":"(IF(BT30=\"\",\"\",((BT30*50)^0.42)*0.64))","v":""},null,null,null,{"$f":"IF(BF30=\"\",\"\",(IF(BF30=\"N\",\"\",(IF(BF30=\"Y\",(IF(BN30=\"\",\"\",(IF($BN30<10,1,(IF($BN30<20,2,3))))*1.05)))))))","v":""},{"$f":"IF(BV30=\"\",\"\",(IF(BF30=\"N\",\"\",(IF(BF30=\"Y\",((100-$BV30)*0.04)+2)))))","v":""},null,{"$f":"IF(CA30=\"\",\"\",(IF(BF30=\"N\",\"\",(IF(BF30=\"Y\",(CA30*1.45))))))","v":""},null,{"$f":"IF(CC30=\"\",\"\",(IF(BF30=\"N\",\"\",(IF(BF30=\"Y\",(CC30*0.65))))))","v":""},null,{"$f":"IF(CE30=\"\",\"\",(IF(BF30=\"N\",\"\",(IF(BF30=\"Y\",(CE30*0.4))))))","v":""},null,{"$f":"IF(CG30=\"\",\"\",(IF(BF30=\"N\",\"\",(IF(BF30=\"Y\",(CG30*0.35))))))","v":""},{"$f":"IF(BY30=\"\",\"\",(SUM(BY30,BZ30,CB30,CD30,CF30,CH30)*SUM(BY30,BZ30,CB30,CD30,CF30,CH30)*SUM(BY30,BZ30,CB30,CD30,CF30,CH30)/55.5))","v":""},{"$f":"IF(CI30=\"\",\"\",IF(CI30<30,0,(IF(CI30>=30,1))))","v":""},{"$f":"IF(CI30=\"\",\"\",(IF(CJ30=1,CJ30=\"@\",(IF(CJ30=0,(IF($CI30<20,4*$CI30/550,(IF($CI30<30,6*$CI30/550,(IF($CI30<41,8*$CI30/550,(IF($CI30<61,10*$CI30/550,12*$CI30/550)))))))))))))","v":""},{"$f":"IF(CI30=\"\",\"\",((IF($CI30<20,4*$CI30/550,(IF($CI30<29.1,6*$CI30/550,(IF($CI30<40.1,8*$CI30/550,(IF($CI30<60.1,10*$CI30/550,12*$CI30/550))))))))*AA30))","v":""},{"$f":"IF(BF30=\"\",\"\",(IF(BF30=\"N\",\"\",(IF(T30=\"Y\",\"Y\",(IF(AA30=\"\",\"Y\",(IF(AA30=0,\"\",(IF(BF30=\"Y\",(AB30+AC30+AE30+AF30+AH30+AI30))))))))))))","v":""},{"$f":"IF(BG30=\"\",\"\",(IF(BG30=\"N\",\"\",(IF(BF30=\"Y\",\"\",(IF(Q30=\"Y\",\"\",(IF(BG30=\"Y\",(AW30+AY30+AZ30+BB30))))))))))","v":""},{"$f":"(IF(BF30=\"Y\",\"\",(IF(BG30=\"Y\",\"\",(IF(AL30>0,\"\",(IF(T30=\"Y\",\"Y\",(IF(AA30=\"\",\"\",(IF(AJ30>0,BI30,(IF(AK30>0,BI30,(AM30+AN30+AR30+AS30+AU30+AV30+AP30+AQ30)))))))))))))))","v":""},{"$f":"(IF(AA30=\"\",\"\",(IF(M30=\"\",\"\",(IF(Q30=\"Y\",\"\",(IF(BG30=\"N\",\"\",(IF(BF30=\"Y\",\"\",(IF(BG30=\"Y\",(AX30+BA30)))))))))))))","v":""},{"$f":"IF(AT30=0,\"\",(IF(AQ30=\"Y\",\"\",(AT30))))","v":""},{"$f":"IF(AA30=\"\",\"\",(IF(Q30=\"Y\",\"\",(IF(AR30=0,\"\",(AR30))))))","v":""},{"$f":"IF(AO30=0,\"\",(IF(Q30=\"Y\",\"\",(AO30*2))))","v":""},{"$f":"IF(AM30=0,\"\",(IF(Q30=\"Y\",\"\",(AM30*2))))","v":""},{"$f":"(IF(AE30=0,\"\",(IF(Q30=\"Y\",\"\",(AE30*2)))))","v":""},{"$f":"IF(AD30=0,\"\",(IF(Q30=\"Y\",\"\",(AD30))))","v":""},{"$f":"IF(BN30=\"\",\"\",(IF(S30=\"Y\",\"\",(IF(R30=\"Y\",\"\",(IF(Q30=\"Y\",\"\",(IF(T30=\"Y\",\"\",(IF(BF30=\"\",\"\",(IF(BF30=\"N\",\"\",(CL30))))))))))))))","v":""},{"$f":"IF(BF30=\"\",\"\",(IF(BF30=\"N\",\"\",(IF(BP30=\"\",\"\",(IF(R30=\"Y\",\"\",(IF(T30=\"Y\",\"\",(IF($CY$4=\"\",\"\",(IF(AA30=\"\",\"\",(PI()*((BP30/2)*(BP30/2)))/10000*AA30)))))))))))))","v":""}]
[null,null,null,null,null,null,null,null,null,null,null,null,null,null,null,null,null,null,null,null,null,{"$f":"IF(BF31=\"\",\"\",(IF(U31=\"\",\"\",(IF(BF31=\"N\",\"\",(IF(BF31=\"Y\",U31)))))))","v":""},null,{"$f":"IF(V31=\"\",\"\",(IF(BF31=\"N\",\"\",((V31*W31)/10000))))","v":""},null,null,null,0,0,0,0,0,0,0,0,0,0,0,0,0,0,0,0,0,0,0,0,0,0,0,0,0,0,0,null,null,null,null,null,null,null,null,null,null,null,null,null,null,null,null,null,null,"",null,null,null,"","",null,"",null,"",null,"",null,"","","","",{"$f":"IF(CI31=\"\",\"\",((IF($CI31<20,4*$CI31/550,(IF($CI31<29.1,6*$CI31/550,(IF($CI31<40.1,8*$CI31/550,(IF($CI31<60.1,10*$CI31/550,12*$CI31/550))))))))*AA31))","v":""},{"$f":"IF(BF31=\"\",\"\",(IF(BF31=\"N\",\"\",(IF(T31=\"Y\",\"Y\",(IF(AA31=\"\",\"Y\",(IF(AA31=0,\"\",(IF(BF31=\"Y\",(AB31+AC31+AE31+AF31+AH31+AI31))))))))))))","v":""},{"$f":"IF(BG31=\"\",\"\",(IF(BG31=\"N\",\"\",(IF(BF31=\"Y\",\"\",(IF(Q31=\"Y\",\"\",(IF(BG31=\"Y\",(AW31+AY31+AZ31+BB31))))))))))","v":""},{"$f":"(IF(BF31=\"Y\",\"\",(IF(BG31=\"Y\",\"\",(IF(AL31>0,\"\",(IF(T31=\"Y\",\"Y\",(IF(AA31=\"\",\"\",(IF(AJ31>0,BI31,(IF(AK31>0,BI31,(AM31+AN31+AR31+AS31+AU31+AV31+AP31+AQ31)))))))))))))))","v":""},{"$f":"(IF(AA31=\"\",\"\",(IF(M31=\"\",\"\",(IF(Q31=\"Y\",\"\",(IF(BG31=\"N\",\"\",(IF(BF31=\"Y\",\"\",(IF(BG31=\"Y\",(AX31+BA31)))))))))))))","v":""},"",{"$f":"IF(AA31=\"\",\"\",(IF(Q31=\"Y\",\"\",(IF(AR31=0,\"\",(AR31))))))","v":""},{"$f":"IF(AO31=0,\"\",(IF(Q31=\"Y\",\"\",(AO31*2))))","v":""},{"$f":"IF(AM31=0,\"\",(IF(Q31=\"Y\",\"\",(AM31*2))))","v":""},"","",{"$f":"IF(BN31=\"\",\"\",(IF(S31=\"Y\",\"\",(IF(R31=\"Y\",\"\",(IF(Q31=\"Y\",\"\",(IF(T31=\"Y\",\"\",(IF(BF31=\"\",\"\",(IF(BF31=\"N\",\"\",(CL31))))))))))))))","v":""},{"$f":"IF(BF31=\"\",\"\",(IF(BF31=\"N\",\"\",(IF(BP31=\"\",\"\",(IF(R31=\"Y\",\"\",(IF(T31=\"Y\",\"\",(IF($CY$4=\"\",\"\",(IF(AA31=\"\",\"\",(PI()*((BP31/2)*(BP31/2)))/10000*AA31)))))))))))))","v":""}]
[null,null,null,"yyyyy","MAJOR PRUNING",null,null,null,null,null,null,null,null,null,null,null,null,null,null,null,null,null,null,null,null,null,null,null,null,null,null,null,null,null,null,null,null,null,null,null,null,null,null,null,null,null,null,null,null,null,null,null,null,null,null,null,null,null,null,null,null,null,null,null,null,null,null,null,null,null,null,null,null,null,null,null,null,null,null,null,null,null,null,null,null,null,null,null,null,null,"20% of Combined SEB for Major Pruning\n(NVA Scattered Tree Scores)",null,null,null,null,null,null,null,null,null,{"$f":"SUM(CW33:CW34)/100*20","v":0}]
[null,null,null,null,null,null,null,null,null,null,null,null,null,null,null,null,null,null,null,null,null,{"$f":"IF(BF33=\"\",\"\",(IF(U33=\"\",\"\",(IF(BF33=\"N\",\"\",(IF(BF33=\"Y\",U33)))))))","v":""},null,{"$f":"IF(V33=\"\",\"\",(IF(BF33=\"N\",\"\",((V33*W33)/10000))))","v":""},null,null,null,{"$f":"IF(M33=\"\",0,(IF(T33=\"\",0,(IF(T33=\"Y\",0,(IF(S33=\"Y\",0, (IF(R33=\"Y\",0,(IF(BF33=\"N\",0,(IF(M33=\"P\",AA33)))))))))))))","v":0},{"$f":"IF(N33=\"\",0,(IF(T33=\"\",0,(IF(T33=\"Y\",0,(IF(S33=\"Y\",0, (IF(R33=\"Y\",0,(IF(BF33=\"N\",0,(IF(N33=\"P\",AA33)))))))))))))","v":0},{"$f":"IF(M33=\"\",0,(IF(T33=\"\",0,(IF(T33=\"N\",0,(IF(S33=\"Y\",0,(IF(BF33=\"N\",0,(IF(T33=\"Y\",(X33))))))))))))","v":0},{"$f":"IF(M33=\"\",0,(IF(T33=\"\",0,(IF(T33=\"Y\",0,(IF(S33=\"N\",0,(IF(BF33=\"N\",0,(IF(M33=\"P\",AA33)))))))))))","v":0},{"$f":"IF(N33=\"\",0,(IF(T33=\"\",0,(IF(T33=\"Y\",0,(IF(S33=\"N\",0, (IF(BF33=\"N\",0,(IF(N33=\"P\",AA33)))))))))))","v":0},{"$f":"IF(M33=\"\",0,(IF(T33=\"\",0,(IF(S33=\"N\",0,(IF(BF33=\"N\",0,(IF(T33=\"N\",0,(IF(T33=\"Y\",U33)))))))))))","v":0},{"$f":"IF(M33=\"\",0,(IF(T33=\"\",0,(IF(T33=\"Y\",0,(IF(S33=\"Y\",0,(IF(R33=\"N\",0,(IF(BF33=\"N\",0,(IF(M33=\"P\",AA33)))))))))))))","v":0},{"$f":"IF(N33=\"\",0,(IF(T33=\"\",0,(IF(T33=\"Y\",0,(IF(R33=\"N\",0, (IF(BF33=\"N\",0,(IF(N33=\"P\",AA33)))))))))))","v":0},{"$f":"IF(M33=\"\",0,(IF(BC33=\"N\",0,(IF(BD33=\"Y\",0,(IF(T33=\"Y\",0,(IF(BC33=\"E\",AA33,(IF(BC33=\"D\",AA33,(IF(BC33=\"O\",AA33,(IF(BC33=\"M\",AA33)))))))))))))))","v":0},{"$f":"IF(N33=\"\",0,(IF(BH33>0,0,(IF(BC33=\"N\",0,(IF(BD33=\"Y\",0,(IF(T33=\"Y\",0,(IF(BC33=\"E\",AA33,(IF(BC33=\"D\",AA33,(IF(BC33=\"O\",AA33,(IF(BC33=\"M\",AA33)))))))))))))))))","v":0},{"$f":"IF(M33=\"\",0,(IF(U33=\"\",0,(IF(BC33=\"N\",0,(IF(BD33=\"Y\",0,IF(T33=\"N\",0,(IF(BC33=\"E\",U33,(IF(BC33=\"D\",U33,(IF(BC33=\"O\",U33,(IF(BC33=\"M\",U33))))))))))))))))","v":0},{"$f":"(IF(M33=\"\",0,(IF(BE33=\"N\",0,(IF(BF33=\"Y\",0,(IF(Q33=\"Y\",0,(IF(R33=\"Y\",0,(IF(T33=\"Y\",0,(IF(BE33=\"Y\",AA33))))))))))))))","v":0},{"$f":"IF(N33=\"\",0,(IF(AA33=\"\",0,(IF(BE33=\"N\",0,(IF(BF33=\"Y\",0,(IF(BH33>0,0,(IF(R33=\"Y\",0,(IF(T33=\"Y\",0,(IF(BE33=\"Y\",AA33)))))))))))))))","v":0},{"$f":"IF(M33=\"\",0,(IF(U33=\"\",0,(IF(T33=\"N\",0,(IF(BE33=\"N\",0,(IF(BF33=\"Y\",0,(IF(BE33=\"Y\",U33)))))))))))","v":0},{"$f":"(IF(M33=\"\",0,(IF(T33=\"Y\",0,(IF(S33=\"Y\",0,(IF(BD33=\"Y\",0,(IF(BF33=\"Y\",0,(IF(R33=\"N\",0,(IF(M33=\"P\",AA33))))))))))))))+(IF(M33=\"\",0,(IF(R33=\"Y\",0,(IF(T33=\"Y\",0,(IF(S33=\"Y\",0,(IF(BD33=\"Y\",0,(IF(BF33=\"Y\",0,(IF(Q33=\"Y\",AA33))))))))))))))","v":0},{"$f":"IF(N33=\"\",0,(IF(T33=\"\",0,(IF(T33=\"Y\",0,(IF(R33=\"N\",0, (IF(BF33=\"Y\",0,(IF(BE33=\"N\",0,(IF(N33=\"P\",AA33)))))))))))))","v":0},{"$f":"(IF(M33=\"\",0,(IF(T33=\"Y\",0,(IF(BG33=\"Y\",0,(IF(BD33=\"N\",0,(IF(Q33=\"Y\",0,(IF(R33=\"Y\",0,(IF(BD33=\"Y\",AA33))))))))))))))","v":0},{"$f":"IF(N33=\"\",0,(IF(BD33=\"\",0,(IF(BD33=\"N\",0,(IF(BH33>0,0,(IF(T33=\"Y\",0,(IF(R33=\"Y\",0,(IF(BD33=\"Y\",AA33)))))))))))))","v":0},{"$f":"IF(M33=\"\",0,(IF(BD33=\"\",0,(IF(BD33=\"N\",0,(IF(T33=\"N\",0,(IF(Q33=\"Y\",0,(IF(BD33=\"Y\",U33)))))))))))","v":0},{"$f":"(IF(M33=\"\",0,(IF(T33=\"\",0,(IF(T33=\"Y\",0,(IF(S33=\"Y\",0,(IF(R33=\"N\",0,(IF(BE33=\"Y\",0,(IF(M33=\"P\",AA33))))))))))))))+(IF(R33=\"Y\",0,(IF(M33=\"\",0,(IF(T33=\"\",0,(IF(T33=\"Y\",0,(IF(S33=\"Y\",0,(IF(BE33=\"Y\",0,(IF(Q33=\"Y\",AA33))))))))))))))","v":0},{"$f":"IF(N33=\"\",0,(IF(T33=\"\",0,(IF(T33=\"Y\",0,(IF(R33=\"N\",0, (IF(BE33=\"Y\",0,(IF(BD33=\"N\",0,(IF(N33=\"P\",AA33)))))))))))))","v":0},{"$f":"IF(M33=\"\",0,(IF(BF33=\"Y\",0,(IF(BH33=\"\",0,(IF(BG33=\"N\",0,(IF(BH33=\"R\",0,(IF(BH33=\"S\",AA33)))))))))))","v":0},{"$f":"(IF(AW33=0,0,AW33))*3","v":0},{"$f":"IF(N33=\"\",0,(IF(BF33=\"Y\",0,(IF(BG33=\"N\",0,(IF(BH33=\"R\",0,(IF(BH33=\"S\",AA33)))))))))","v":0},{"$f":"IF(M33=\"\",0,(IF(BF33=\"Y\",0,(IF(BG33=\"N\",0,(IF(BH33=\"\",0,(IF(BH33=\"S\",0,(IF(BH33=\"R\",AA33)))))))))))","v":0},{"$f":"(IF(AZ33=0,0,AZ33))*2","v":0},{"$f":"IF(N33=\"\",0,(IF(BF33=\"Y\",0,(IF(BG33=\"N\",0,(IF(BH33=\"S\",0,(IF(BH33=\"R\",AA33)))))))))","v":0},null,null,null,null,null,null,null,null,null,null,null,null,null,null,null,null,null,null,{"$f":"(IF(BT33=\"\",\"\",((BT33*50)^0.42)*0.64))","v":""},null,null,null,{"$f":"IF(BF33=\"\",\"\",(IF(BF33=\"N\",\"\",(IF(BF33=\"Y\",(IF(BN33=\"\",\"\",(IF($BN33<10,1,(IF($BN33<20,2,3))))*1.05)))))))","v":""},{"$f":"IF(BV33=\"\",\"\",(IF(BF33=\"N\",\"\",(IF(BF33=\"Y\",((100-$BV33)*0.04)+2)))))","v":""},null,{"$f":"IF(CA33=\"\",\"\",(IF(BF33=\"N\",\"\",(IF(BF33=\"Y\",(CA33*1.45))))))","v":""},null,{"$f":"IF(CC33=\"\",\"\",(IF(BF33=\"N\",\"\",(IF(BF33=\"Y\",(CC33*0.65))))))","v":""},null,{"$f":"IF(CE33=\"\",\"\",(IF(BF33=\"N\",\"\",(IF(BF33=\"Y\",(CE33*0.4))))))","v":""},null,{"$f":"IF(CG33=\"\",\"\",(IF(BF33=\"N\",\"\",(IF(BF33=\"Y\",(CG33*0.35))))))","v":""},{"$f":"IF(BY33=\"\",\"\",(SUM(BY33,BZ33,CB33,CD33,CF33,CH33)*SUM(BY33,BZ33,CB33,CD33,CF33,CH33)*SUM(BY33,BZ33,CB33,CD33,CF33,CH33)/55.5))","v":""},{"$f":"IF(CI33=\"\",\"\",IF(CI33<30,0,(IF(CI33>=30,1))))","v":""},{"$f":"IF(CI33=\"\",\"\",(IF(CJ33=1,CJ33=\"@\",(IF(CJ33=0,(IF($CI33<20,4*$CI33/550,(IF($CI33<30,6*$CI33/550,(IF($CI33<41,8*$CI33/550,(IF($CI33<61,10*$CI33/550,12*$CI33/550)))))))))))))","v":""},{"$f":"IF(CI33=\"\",\"\",((IF($CI33<20,4*$CI33/550,(IF($CI33<29.1,6*$CI33/550,(IF($CI33<40.1,8*$CI33/550,(IF($CI33<60.1,10*$CI33/550,12*$CI33/550))))))))*AA33))","v":""},{"$f":"IF(BF33=\"\",\"\",(IF(BF33=\"N\",\"\",(IF(T33=\"Y\",\"Y\",(IF(AA33=\"\",\"Y\",(IF(AA33=0,\"\",(IF(BF33=\"Y\",(AB33+AC33+AE33+AF33+AH33+AI33))))))))))))","v":""},{"$f":"IF(BG33=\"\",\"\",(IF(BG33=\"N\",\"\",(IF(BF33=\"Y\",\"\",(IF(Q33=\"Y\",\"\",(IF(BG33=\"Y\",(AW33+AY33+AZ33+BB33))))))))))","v":""},{"$f":"(IF(BF33=\"Y\",\"\",(IF(BG33=\"Y\",\"\",(IF(AL33>0,\"\",(IF(T33=\"Y\",\"Y\",(IF(AA33=\"\",\"\",(IF(AJ33>0,BI33,(IF(AK33>0,BI33,(AM33+AN33+AR33+AS33+AU33+AV33+AP33+AQ33)))))))))))))))","v":""},{"$f":"(IF(AA33=\"\",\"\",(IF(M33=\"\",\"\",(IF(Q33=\"Y\",\"\",(IF(BG33=\"N\",\"\",(IF(BF33=\"Y\",\"\",(IF(BG33=\"Y\",(AX33+BA33)))))))))))))","v":""},{"$f":"IF(AT33=0,\"\",(IF(AQ33=\"Y\",\"\",(AT33))))","v":""},{"$f":"IF(AA33=\"\",\"\",(IF(Q33=\"Y\",\"\",(IF(AR33=0,\"\",(AR33))))))","v":""},{"$f":"IF(AO33=0,\"\",(IF(Q33=\"Y\",\"\",(AO33*2))))","v":""},{"$f":"IF(AM33=0,\"\",(IF(Q33=\"Y\",\"\",(AM33*2))))","v":""},{"$f":"(IF(AE33=0,\"\",(IF(Q33=\"Y\",\"\",(AE33*2)))))","v":""},{"$f":"IF(AD33=0,\"\",(IF(Q33=\"Y\",\"\",(AD33))))","v":""},{"$f":"IF(BN33=\"\",\"\",(IF(S33=\"Y\",\"\",(IF(R33=\"Y\",\"\",(IF(Q33=\"Y\",\"\",(IF(T33=\"Y\",\"\",(IF(BF33=\"\",\"\",(IF(BF33=\"N\",\"\",(CL33))))))))))))))","v":""},{"$f":"IF(BF33=\"\",\"\",(IF(BF33=\"N\",\"\",(IF(BP33=\"\",\"\",(IF(R33=\"Y\",\"\",(IF(T33=\"Y\",\"\",(IF($CY$4=\"\",\"\",(IF(AA33=\"\",\"\",(PI()*((BP33/2)*(BP33/2)))/10000*AA33)))))))))))))","v":""}]
[null,null,null,null,null,null,null,null,null,null,null,null,null,null,null,null,null,null,null,null,null,{"$f":"IF(BF34=\"\",\"\",(IF(U34=\"\",\"\",(IF(BF34=\"N\",\"\",(IF(BF34=\"Y\",U34)))))))","v":""},null,{"$f":"IF(V34=\"\",\"\",(IF(BF34=\"N\",\"\",((V34*W34)/10000))))","v":""},null,null,null,0,0,0,0,0,0,0,0,0,0,0,0,0,0,0,0,0,0,0,0,0,0,0,0,0,0,0,null,null,null,null,null,null,null,null,null,null,null,null,null,null,null,null,null,null,"",null,null,null,"","",null,"",null,"",null,"",null,"","","","",{"$f":"IF(CI34=\"\",\"\",((IF($CI34<20,4*$CI34/550,(IF($CI34<29.1,6*$CI34/550,(IF($CI34<40.1,8*$CI34/550,(IF($CI34<60.1,10*$CI34/550,12*$CI34/550))))))))*AA34))","v":""},{"$f":"IF(BF34=\"\",\"\",(IF(BF34=\"N\",\"\",(IF(T34=\"Y\",\"Y\",(IF(AA34=\"\",\"Y\",(IF(AA34=0,\"\",(IF(BF34=\"Y\",(AB34+AC34+AE34+AF34+AH34+AI34))))))))))))","v":""},{"$f":"IF(BG34=\"\",\"\",(IF(BG34=\"N\",\"\",(IF(BF34=\"Y\",\"\",(IF(Q34=\"Y\",\"\",(IF(BG34=\"Y\",(AW34+AY34+AZ34+BB34))))))))))","v":""},{"$f":"(IF(BF34=\"Y\",\"\",(IF(BG34=\"Y\",\"\",(IF(AL34>0,\"\",(IF(T34=\"Y\",\"Y\",(IF(AA34=\"\",\"\",(IF(AJ34>0,BI34,(IF(AK34>0,BI34,(AM34+AN34+AR34+AS34+AU34+AV34+AP34+AQ34)))))))))))))))","v":""},{"$f":"(IF(AA34=\"\",\"\",(IF(M34=\"\",\"\",(IF(Q34=\"Y\",\"\",(IF(BG34=\"N\",\"\",(IF(BF34=\"Y\",\"\",(IF(BG34=\"Y\",(AX34+BA34)))))))))))))","v":""},"",{"$f":"IF(AA34=\"\",\"\",(IF(Q34=\"Y\",\"\",(IF(AR34=0,\"\",(AR34))))))","v":""},{"$f":"IF(AO34=0,\"\",(IF(Q34=\"Y\",\"\",(AO34*2))))","v":""},{"$f":"IF(AM34=0,\"\",(IF(Q34=\"Y\",\"\",(AM34*2))))","v":""},"","",{"$f":"IF(BN34=\"\",\"\",(IF(S34=\"Y\",\"\",(IF(R34=\"Y\",\"\",(IF(Q34=\"Y\",\"\",(IF(T34=\"Y\",\"\",(IF(BF34=\"\",\"\",(IF(BF34=\"N\",\"\",(CL34))))))))))))))","v":""},{"$f":"IF(BF34=\"\",\"\",(IF(BF34=\"N\",\"\",(IF(BP34=\"\",\"\",(IF(R34=\"Y\",\"\",(IF(T34=\"Y\",\"\",(IF($CY$4=\"\",\"\",(IF(AA34=\"\",\"\",(PI()*((BP34/2)*(BP34/2)))/10000*AA34)))))))))))))","v":""}]
[null,null,null,"qqqqq","MINOR PRUNING\nNo SEB/Approvals requirement for Minor Pruning"]
[null,null,null,null,null,null,null,null,null,null,null,null,null,null,null,null,null,null,null,null,null,{"$f":"IF(BF36=\"\",\"\",(IF(U36=\"\",\"\",(IF(BF36=\"N\",\"\",(IF(BF36=\"Y\",U36)))))))","v":""},null,{"$f":"IF(V36=\"\",\"\",(IF(BF36=\"N\",\"\",((V36*W36)/10000))))","v":""},null,null,null,{"$f":"IF(M36=\"\",0,(IF(T36=\"\",0,(IF(T36=\"Y\",0,(IF(S36=\"Y\",0, (IF(R36=\"Y\",0,(IF(BF36=\"N\",0,(IF(M36=\"P\",AA36)))))))))))))","v":0},{"$f":"IF(N36=\"\",0,(IF(T36=\"\",0,(IF(T36=\"Y\",0,(IF(S36=\"Y\",0, (IF(R36=\"Y\",0,(IF(BF36=\"N\",0,(IF(N36=\"P\",AA36)))))))))))))","v":0},{"$f":"IF(M36=\"\",0,(IF(T36=\"\",0,(IF(T36=\"N\",0,(IF(S36=\"Y\",0,(IF(BF36=\"N\",0,(IF(T36=\"Y\",(X36))))))))))))","v":0},{"$f":"IF(M36=\"\",0,(IF(T36=\"\",0,(IF(T36=\"Y\",0,(IF(S36=\"N\",0,(IF(BF36=\"N\",0,(IF(M36=\"P\",AA36)))))))))))","v":0},{"$f":"IF(N36=\"\",0,(IF(T36=\"\",0,(IF(T36=\"Y\",0,(IF(S36=\"N\",0, (IF(BF36=\"N\",0,(IF(N36=\"P\",AA36)))))))))))","v":0},{"$f":"IF(M36=\"\",0,(IF(T36=\"\",0,(IF(S36=\"N\",0,(IF(BF36=\"N\",0,(IF(T36=\"N\",0,(IF(T36=\"Y\",U36)))))))))))","v":0},{"$f":"IF(M36=\"\",0,(IF(T36=\"\",0,(IF(T36=\"Y\",0,(IF(S36=\"Y\",0,(IF(R36=\"N\",0,(IF(BF36=\"N\",0,(IF(M36=\"P\",AA36)))))))))))))","v":0},{"$f":"IF(N36=\"\",0,(IF(T36=\"\",0,(IF(T36=\"Y\",0,(IF(R36=\"N\",0, (IF(BF36=\"N\",0,(IF(N36=\"P\",AA36)))))))))))","v":0},{"$f":"IF(M36=\"\",0,(IF(BC36=\"N\",0,(IF(BD36=\"Y\",0,(IF(T36=\"Y\",0,(IF(BC36=\"E\",AA36,(IF(BC36=\"D\",AA36,(IF(BC36=\"O\",AA36,(IF(BC36=\"M\",AA36)))))))))))))))","v":0},{"$f":"IF(N36=\"\",0,(IF(BH36>0,0,(IF(BC36=\"N\",0,(IF(BD36=\"Y\",0,(IF(T36=\"Y\",0,(IF(BC36=\"E\",AA36,(IF(BC36=\"D\",AA36,(IF(BC36=\"O\",AA36,(IF(BC36=\"M\",AA36)))))))))))))))))","v":0},{"$f":"IF(M36=\"\",0,(IF(U36=\"\",0,(IF(BC36=\"N\",0,(IF(BD36=\"Y\",0,IF(T36=\"N\",0,(IF(BC36=\"E\",U36,(IF(BC36=\"D\",U36,(IF(BC36=\"O\",U36,(IF(BC36=\"M\",U36))))))))))))))))","v":0},{"$f":"(IF(M36=\"\",0,(IF(BE36=\"N\",0,(IF(BF36=\"Y\",0,(IF(Q36=\"Y\",0,(IF(R36=\"Y\",0,(IF(T36=\"Y\",0,(IF(BE36=\"Y\",AA36))))))))))))))","v":0},{"$f":"IF(N36=\"\",0,(IF(AA36=\"\",0,(IF(BE36=\"N\",0,(IF(BF36=\"Y\",0,(IF(BH36>0,0,(IF(R36=\"Y\",0,(IF(T36=\"Y\",0,(IF(BE36=\"Y\",AA36)))))))))))))))","v":0},{"$f":"IF(M36=\"\",0,(IF(U36=\"\",0,(IF(T36=\"N\",0,(IF(BE36=\"N\",0,(IF(BF36=\"Y\",0,(IF(BE36=\"Y\",U36)))))))))))","v":0},{"$f":"(IF(M36=\"\",0,(IF(T36=\"Y\",0,(IF(S36=\"Y\",0,(IF(BD36=\"Y\",0,(IF(BF36=\"Y\",0,(IF(R36=\"N\",0,(IF(M36=\"P\",AA36))))))))))))))+(IF(M36=\"\",0,(IF(R36=\"Y\",0,(IF(T36=\"Y\",0,(IF(S36=\"Y\",0,(IF(BD36=\"Y\",0,(IF(BF36=\"Y\",0,(IF(Q36=\"Y\",AA36))))))))))))))","v":0},{"$f":"IF(N36=\"\",0,(IF(T36=\"\",0,(IF(T36=\"Y\",0,(IF(R36=\"N\",0, (IF(BF36=\"Y\",0,(IF(BE36=\"N\",0,(IF(N36=\"P\",AA36)))))))))))))","v":0},{"$f":"(IF(M36=\"\",0,(IF(T36=\"Y\",0,(IF(BG36=\"Y\",0,(IF(BD36=\"N\",0,(IF(Q36=\"Y\",0,(IF(R36=\"Y\",0,(IF(BD36=\"Y\",AA36))))))))))))))","v":0},{"$f":"IF(N36=\"\",0,(IF(BD36=\"\",0,(IF(BD36=\"N\",0,(IF(BH36>0,0,(IF(T36=\"Y\",0,(IF(R36=\"Y\",0,(IF(BD36=\"Y\",AA36)))))))))))))","v":0},{"$f":"IF(M36=\"\",0,(IF(BD36=\"\",0,(IF(BD36=\"N\",0,(IF(T36=\"N\",0,(IF(Q36=\"Y\",0,(IF(BD36=\"Y\",U36)))))))))))","v":0},{"$f":"(IF(M36=\"\",0,(IF(T36=\"\",0,(IF(T36=\"Y\",0,(IF(S36=\"Y\",0,(IF(R36=\"N\",0,(IF(BE36=\"Y\",0,(IF(M36=\"P\",AA36))))))))))))))+(IF(R36=\"Y\",0,(IF(M36=\"\",0,(IF(T36=\"\",0,(IF(T36=\"Y\",0,(IF(S36=\"Y\",0,(IF(BE36=\"Y\",0,(IF(Q36=\"Y\",AA36))))))))))))))","v":0},{"$f":"IF(N36=\"\",0,(IF(T36=\"\",0,(IF(T36=\"Y\",0,(IF(R36=\"N\",0, (IF(BE36=\"Y\",0,(IF(BD36=\"N\",0,(IF(N36=\"P\",AA36)))))))))))))","v":0},{"$f":"IF(M36=\"\",0,(IF(BF36=\"Y\",0,(IF(BH36=\"\",0,(IF(BG36=\"N\",0,(IF(BH36=\"R\",0,(IF(BH36=\"S\",AA36)))))))))))","v":0},{"$f":"(IF(AW36=0,0,AW36))*3","v":0},{"$f":"IF(N36=\"\",0,(IF(BF36=\"Y\",0,(IF(BG36=\"N\",0,(IF(BH36=\"R\",0,(IF(BH36=\"S\",AA36)))))))))","v":0},{"$f":"IF(M36=\"\",0,(IF(BF36=\"Y\",0,(IF(BG36=\"N\",0,(IF(BH36=\"\",0,(IF(BH36=\"S\",0,(IF(BH36=\"R\",AA36)))))))))))","v":0},{"$f":"(IF(AZ36=0,0,AZ36))*2","v":0},{"$f":"IF(N36=\"\",0,(IF(BF36=\"Y\",0,(IF(BG36=\"N\",0,(IF(BH36=\"S\",0,(IF(BH36=\"R\",AA36)))))))))","v":0},null,null,null,null,null,null,null,null,null,null,null,null,null,null,null,null,null,null,{"$f":"(IF(BT36=\"\",\"\",((BT36*50)^0.42)*0.64))","v":""},null,null,null,{"$f":"IF(BF36=\"\",\"\",(IF(BF36=\"N\",\"\",(IF(BF36=\"Y\",(IF(BN36=\"\",\"\",(IF($BN36<10,1,(IF($BN36<20,2,3))))*1.05)))))))","v":""},{"$f":"IF(BV36=\"\",\"\",(IF(BF36=\"N\",\"\",(IF(BF36=\"Y\",((100-$BV36)*0.04)+2)))))","v":""},null,{"$f":"IF(CA36=\"\",\"\",(IF(BF36=\"N\",\"\",(IF(BF36=\"Y\",(CA36*1.45))))))","v":""},null,{"$f":"IF(CC36=\"\",\"\",(IF(BF36=\"N\",\"\",(IF(BF36=\"Y\",(CC36*0.65))))))","v":""},null,{"$f":"IF(CE36=\"\",\"\",(IF(BF36=\"N\",\"\",(IF(BF36=\"Y\",(CE36*0.4))))))","v":""},null,{"$f":"IF(CG36=\"\",\"\",(IF(BF36=\"N\",\"\",(IF(BF36=\"Y\",(CG36*0.35))))))","v":""},{"$f":"IF(BY36=\"\",\"\",(SUM(BY36,BZ36,CB36,CD36,CF36,CH36)*SUM(BY36,BZ36,CB36,CD36,CF36,CH36)*SUM(BY36,BZ36,CB36,CD36,CF36,CH36)/55.5))","v":""},{"$f":"IF(CI36=\"\",\"\",IF(CI36<30,0,(IF(CI36>=30,1))))","v":""},{"$f":"IF(CI36=\"\",\"\",(IF(CJ36=1,CJ36=\"@\",(IF(CJ36=0,(IF($CI36<20,4*$CI36/550,(IF($CI36<30,6*$CI36/550,(IF($CI36<41,8*$CI36/550,(IF($CI36<61,10*$CI36/550,12*$CI36/550)))))))))))))","v":""},{"$f":"IF(CI36=\"\",\"\",((IF($CI36<20,4*$CI36/550,(IF($CI36<29.1,6*$CI36/550,(IF($CI36<40.1,8*$CI36/550,(IF($CI36<60.1,10*$CI36/550,12*$CI36/550))))))))*AA36))","v":""},{"$f":"IF(BF36=\"\",\"\",(IF(BF36=\"N\",\"\",(IF(T36=\"Y\",\"Y\",(IF(AA36=\"\",\"Y\",(IF(AA36=0,\"\",(IF(BF36=\"Y\",(AB36+AC36+AE36+AF36+AH36+AI36))))))))))))","v":""},{"$f":"IF(BG36=\"\",\"\",(IF(BG36=\"N\",\"\",(IF(BF36=\"Y\",\"\",(IF(Q36=\"Y\",\"\",(IF(BG36=\"Y\",(AW36+AY36+AZ36+BB36))))))))))","v":""},{"$f":"(IF(BF36=\"Y\",\"\",(IF(BG36=\"Y\",\"\",(IF(AL36>0,\"\",(IF(T36=\"Y\",\"Y\",(IF(AA36=\"\",\"\",(IF(AJ36>0,BI36,(IF(AK36>0,BI36,(AM36+AN36+AR36+AS36+AU36+AV36+AP36+AQ36)))))))))))))))","v":""},{"$f":"(IF(AA36=\"\",\"\",(IF(M36=\"\",\"\",(IF(Q36=\"Y\",\"\",(IF(BG36=\"N\",\"\",(IF(BF36=\"Y\",\"\",(IF(BG36=\"Y\",(AX36+BA36)))))))))))))","v":""},{"$f":"IF(AT36=0,\"\",(IF(AQ36=\"Y\",\"\",(AT36))))","v":""},{"$f":"IF(AA36=\"\",\"\",(IF(Q36=\"Y\",\"\",(IF(AR36=0,\"\",(AR36))))))","v":""},{"$f":"IF(AO36=0,\"\",(IF(Q36=\"Y\",\"\",(AO36*2))))","v":""},{"$f":"IF(AM36=0,\"\",(IF(Q36=\"Y\",\"\",(AM36*2))))","v":""},{"$f":"(IF(AE36=0,\"\",(IF(Q36=\"Y\",\"\",(AE36*2)))))","v":""},{"$f":"IF(AD36=0,\"\",(IF(Q36=\"Y\",\"\",(AD36))))","v":""},{"$f":"IF(BN36=\"\",\"\",(IF(S36=\"Y\",\"\",(IF(R36=\"Y\",\"\",(IF(Q36=\"Y\",\"\",(IF(T36=\"Y\",\"\",(IF(BF36=\"\",\"\",(IF(BF36=\"N\",\"\",(CL36))))))))))))))","v":""},{"$f":"IF(BF36=\"\",\"\",(IF(BF36=\"N\",\"\",(IF(BP36=\"\",\"\",(IF(R36=\"Y\",\"\",(IF(T36=\"Y\",\"\",(IF($CY$4=\"\",\"\",(IF(AA36=\"\",\"\",(PI()*((BP36/2)*(BP36/2)))/10000*AA36)))))))))))))","v":""}]
[null,null,null,null,null,null,null,null,null,null,null,null,null,null,null,null,null,null,null,null,null,{"$f":"IF(BF37=\"\",\"\",(IF(U37=\"\",\"\",(IF(BF37=\"N\",\"\",(IF(BF37=\"Y\",U37)))))))","v":""},null,{"$f":"IF(V37=\"\",\"\",(IF(BF37=\"N\",\"\",((V37*W37)/10000))))","v":""},null,null,null,0,0,0,0,0,0,0,0,0,0,0,0,0,0,0,0,0,0,0,0,0,0,0,0,0,0,0,null,null,null,null,null,null,null,null,null,null,null,null,null,null,null,null,null,null,"",null,null,null,"","",null,"",null,"",null,"",null,"","","","",{"$f":"IF(CI37=\"\",\"\",((IF($CI37<20,4*$CI37/550,(IF($CI37<29.1,6*$CI37/550,(IF($CI37<40.1,8*$CI37/550,(IF($CI37<60.1,10*$CI37/550,12*$CI37/550))))))))*AA37))","v":""},{"$f":"IF(BF37=\"\",\"\",(IF(BF37=\"N\",\"\",(IF(T37=\"Y\",\"Y\",(IF(AA37=\"\",\"Y\",(IF(AA37=0,\"\",(IF(BF37=\"Y\",(AB37+AC37+AE37+AF37+AH37+AI37))))))))))))","v":""},{"$f":"IF(BG37=\"\",\"\",(IF(BG37=\"N\",\"\",(IF(BF37=\"Y\",\"\",(IF(Q37=\"Y\",\"\",(IF(BG37=\"Y\",(AW37+AY37+AZ37+BB37))))))))))","v":""},{"$f":"(IF(BF37=\"Y\",\"\",(IF(BG37=\"Y\",\"\",(IF(AL37>0,\"\",(IF(T37=\"Y\",\"Y\",(IF(AA37=\"\",\"\",(IF(AJ37>0,BI37,(IF(AK37>0,BI37,(AM37+AN37+AR37+AS37+AU37+AV37+AP37+AQ37)))))))))))))))","v":""},{"$f":"(IF(AA37=\"\",\"\",(IF(M37=\"\",\"\",(IF(Q37=\"Y\",\"\",(IF(BG37=\"N\",\"\",(IF(BF37=\"Y\",\"\",(IF(BG37=\"Y\",(AX37+BA37)))))))))))))","v":""},"",{"$f":"IF(AA37=\"\",\"\",(IF(Q37=\"Y\",\"\",(IF(AR37=0,\"\",(AR37))))))","v":""},{"$f":"IF(AO37=0,\"\",(IF(Q37=\"Y\",\"\",(AO37*2))))","v":""},{"$f":"IF(AM37=0,\"\",(IF(Q37=\"Y\",\"\",(AM37*2))))","v":""},"","",{"$f":"IF(BN37=\"\",\"\",(IF(S37=\"Y\",\"\",(IF(R37=\"Y\",\"\",(IF(Q37=\"Y\",\"\",(IF(T37=\"Y\",\"\",(IF(BF37=\"\",\"\",(IF(BF37=\"N\",\"\",(CL37))))))))))))))","v":""},{"$f":"IF(BF37=\"\",\"\",(IF(BF37=\"N\",\"\",(IF(BP37=\"\",\"\",(IF(R37=\"Y\",\"\",(IF(T37=\"Y\",\"\",(IF($CY$4=\"\",\"\",(IF(AA37=\"\",\"\",(PI()*((BP37/2)*(BP37/2)))/10000*AA37)))))))))))))","v":""}]
[null,null,null,"zzzzz","MONITOR\nTo be added to the Monitoring Program"]
[null,null,null,null,null,null,null,null,null,null,null,null,null,null,null,null,null,null,null,null,null,{"$f":"IF(BF39=\"\",\"\",(IF(U39=\"\",\"\",(IF(BF39=\"N\",\"\",(IF(BF39=\"Y\",U39)))))))","v":""},null,{"$f":"IF(V39=\"\",\"\",(IF(BF39=\"N\",\"\",((V39*W39)/10000))))","v":""},null,null,null,{"$f":"IF(M39=\"\",0,(IF(T39=\"\",0,(IF(T39=\"Y\",0,(IF(S39=\"Y\",0, (IF(R39=\"Y\",0,(IF(BF39=\"N\",0,(IF(M39=\"P\",AA39)))))))))))))","v":0},{"$f":"IF(N39=\"\",0,(IF(T39=\"\",0,(IF(T39=\"Y\",0,(IF(S39=\"Y\",0, (IF(R39=\"Y\",0,(IF(BF39=\"N\",0,(IF(N39=\"P\",AA39)))))))))))))","v":0},{"$f":"IF(M39=\"\",0,(IF(T39=\"\",0,(IF(T39=\"N\",0,(IF(S39=\"Y\",0,(IF(BF39=\"N\",0,(IF(T39=\"Y\",(X39))))))))))))","v":0},{"$f":"IF(M39=\"\",0,(IF(T39=\"\",0,(IF(T39=\"Y\",0,(IF(S39=\"N\",0,(IF(BF39=\"N\",0,(IF(M39=\"P\",AA39)))))))))))","v":0},{"$f":"IF(N39=\"\",0,(IF(T39=\"\",0,(IF(T39=\"Y\",0,(IF(S39=\"N\",0, (IF(BF39=\"N\",0,(IF(N39=\"P\",AA39)))))))))))","v":0},{"$f":"IF(M39=\"\",0,(IF(T39=\"\",0,(IF(S39=\"N\",0,(IF(BF39=\"N\",0,(IF(T39=\"N\",0,(IF(T39=\"Y\",U39)))))))))))","v":0},{"$f":"IF(M39=\"\",0,(IF(T39=\"\",0,(IF(T39=\"Y\",0,(IF(S39=\"Y\",0,(IF(R39=\"N\",0,(IF(BF39=\"N\",0,(IF(M39=\"P\",AA39)))))))))))))","v":0},{"$f":"IF(N39=\"\",0,(IF(T39=\"\",0,(IF(T39=\"Y\",0,(IF(R39=\"N\",0, (IF(BF39=\"N\",0,(IF(N39=\"P\",AA39)))))))))))","v":0},{"$f":"IF(M39=\"\",0,(IF(BC39=\"N\",0,(IF(BD39=\"Y\",0,(IF(T39=\"Y\",0,(IF(BC39=\"E\",AA39,(IF(BC39=\"D\",AA39,(IF(BC39=\"O\",AA39,(IF(BC39=\"M\",AA39)))))))))))))))","v":0},{"$f":"IF(N39=\"\",0,(IF(BH39>0,0,(IF(BC39=\"N\",0,(IF(BD39=\"Y\",0,(IF(T39=\"Y\",0,(IF(BC39=\"E\",AA39,(IF(BC39=\"D\",AA39,(IF(BC39=\"O\",AA39,(IF(BC39=\"M\",AA39)))))))))))))))))","v":0},{"$f":"IF(M39=\"\",0,(IF(U39=\"\",0,(IF(BC39=\"N\",0,(IF(BD39=\"Y\",0,IF(T39=\"N\",0,(IF(BC39=\"E\",U39,(IF(BC39=\"D\",U39,(IF(BC39=\"O\",U39,(IF(BC39=\"M\",U39))))))))))))))))","v":0},{"$f":"(IF(M39=\"\",0,(IF(BE39=\"N\",0,(IF(BF39=\"Y\",0,(IF(Q39=\"Y\",0,(IF(R39=\"Y\",0,(IF(T39=\"Y\",0,(IF(BE39=\"Y\",AA39))))))))))))))","v":0},{"$f":"IF(N39=\"\",0,(IF(AA39=\"\",0,(IF(BE39=\"N\",0,(IF(BF39=\"Y\",0,(IF(BH39>0,0,(IF(R39=\"Y\",0,(IF(T39=\"Y\",0,(IF(BE39=\"Y\",AA39)))))))))))))))","v":0},{"$f":"IF(M39=\"\",0,(IF(U39=\"\",0,(IF(T39=\"N\",0,(IF(BE39=\"N\",0,(IF(BF39=\"Y\",0,(IF(BE39=\"Y\",U39)))))))))))","v":0},{"$f":"(IF(M39=\"\",0,(IF(T39=\"Y\",0,(IF(S39=\"Y\",0,(IF(BD39=\"Y\",0,(IF(BF39=\"Y\",0,(IF(R39=\"N\",0,(IF(M39=\"P\",AA39))))))))))))))+(IF(M39=\"\",0,(IF(R39=\"Y\",0,(IF(T39=\"Y\",0,(IF(S39=\"Y\",0,(IF(BD39=\"Y\",0,(IF(BF39=\"Y\",0,(IF(Q39=\"Y\",AA39))))))))))))))","v":0},{"$f":"IF(N39=\"\",0,(IF(T39=\"\",0,(IF(T39=\"Y\",0,(IF(R39=\"N\",0, (IF(BF39=\"Y\",0,(IF(BE39=\"N\",0,(IF(N39=\"P\",AA39)))))))))))))","v":0},{"$f":"(IF(M39=\"\",0,(IF(T39=\"Y\",0,(IF(BG39=\"Y\",0,(IF(BD39=\"N\",0,(IF(Q39=\"Y\",0,(IF(R39=\"Y\",0,(IF(BD39=\"Y\",AA39))))))))))))))","v":0},{"$f":"IF(N39=\"\",0,(IF(BD39=\"\",0,(IF(BD39=\"N\",0,(IF(BH39>0,0,(IF(T39=\"Y\",0,(IF(R39=\"Y\",0,(IF(BD39=\"Y\",AA39)))))))))))))","v":0},{"$f":"IF(M39=\"\",0,(IF(BD39=\"\",0,(IF(BD39=\"N\",0,(IF(T39=\"N\",0,(IF(Q39=\"Y\",0,(IF(BD39=\"Y\",U39)))))))))))","v":0},{"$f":"(IF(M39=\"\",0,(IF(T39=\"\",0,(IF(T39=\"Y\",0,(IF(S39=\"Y\",0,(IF(R39=\"N\",0,(IF(BE39=\"Y\",0,(IF(M39=\"P\",AA39))))))))))))))+(IF(R39=\"Y\",0,(IF(M39=\"\",0,(IF(T39=\"\",0,(IF(T39=\"Y\",0,(IF(S39=\"Y\",0,(IF(BE39=\"Y\",0,(IF(Q39=\"Y\",AA39))))))))))))))","v":0},{"$f":"IF(N39=\"\",0,(IF(T39=\"\",0,(IF(T39=\"Y\",0,(IF(R39=\"N\",0, (IF(BE39=\"Y\",0,(IF(BD39=\"N\",0,(IF(N39=\"P\",AA39)))))))))))))","v":0},{"$f":"IF(M39=\"\",0,(IF(BF39=\"Y\",0,(IF(BH39=\"\",0,(IF(BG39=\"N\",0,(IF(BH39=\"R\",0,(IF(BH39=\"S\",AA39)))))))))))","v":0},{"$f":"(IF(AW39=0,0,AW39))*3","v":0},{"$f":"IF(N39=\"\",0,(IF(BF39=\"Y\",0,(IF(BG39=\"N\",0,(IF(BH39=\"R\",0,(IF(BH39=\"S\",AA39)))))))))","v":0},{"$f":"IF(M39=\"\",0,(IF(BF39=\"Y\",0,(IF(BG39=\"N\",0,(IF(BH39=\"\",0,(IF(BH39=\"S\",0,(IF(BH39=\"R\",AA39)))))))))))","v":0},{"$f":"(IF(AZ39=0,0,AZ39))*2","v":0},{"$f":"IF(N39=\"\",0,(IF(BF39=\"Y\",0,(IF(BG39=\"N\",0,(IF(BH39=\"S\",0,(IF(BH39=\"R\",AA39)))))))))","v":0},null,null,null,null,null,null,null,null,null,null,null,null,null,null,null,null,null,null,{"$f":"(IF(BT39=\"\",\"\",((BT39*50)^0.42)*0.64))","v":""},null,null,null,{"$f":"IF(BF39=\"\",\"\",(IF(BF39=\"N\",\"\",(IF(BF39=\"Y\",(IF(BN39=\"\",\"\",(IF($BN39<10,1,(IF($BN39<20,2,3))))*1.05)))))))","v":""},{"$f":"IF(BV39=\"\",\"\",(IF(BF39=\"N\",\"\",(IF(BF39=\"Y\",((100-$BV39)*0.04)+2)))))","v":""},null,{"$f":"IF(CA39=\"\",\"\",(IF(BF39=\"N\",\"\",(IF(BF39=\"Y\",(CA39*1.45))))))","v":""},null,{"$f":"IF(CC39=\"\",\"\",(IF(BF39=\"N\",\"\",(IF(BF39=\"Y\",(CC39*0.65))))))","v":""},null,{"$f":"IF(CE39=\"\",\"\",(IF(BF39=\"N\",\"\",(IF(BF39=\"Y\",(CE39*0.4))))))","v":""},null,{"$f":"IF(CG39=\"\",\"\",(IF(BF39=\"N\",\"\",(IF(BF39=\"Y\",(CG39*0.35))))))","v":""},{"$f":"IF(BY39=\"\",\"\",(SUM(BY39,BZ39,CB39,CD39,CF39,CH39)*SUM(BY39,BZ39,CB39,CD39,CF39,CH39)*SUM(BY39,BZ39,CB39,CD39,CF39,CH39)/55.5))","v":""},{"$f":"IF(CI39=\"\",\"\",IF(CI39<30,0,(IF(CI39>=30,1))))","v":""},{"$f":"IF(CI39=\"\",\"\",(IF(CJ39=1,CJ39=\"@\",(IF(CJ39=0,(IF($CI39<20,4*$CI39/550,(IF($CI39<30,6*$CI39/550,(IF($CI39<41,8*$CI39/550,(IF($CI39<61,10*$CI39/550,12*$CI39/550)))))))))))))","v":""},{"$f":"IF(CI39=\"\",\"\",((IF($CI39<20,4*$CI39/550,(IF($CI39<29.1,6*$CI39/550,(IF($CI39<40.1,8*$CI39/550,(IF($CI39<60.1,10*$CI39/550,12*$CI39/550))))))))*AA39))","v":""},{"$f":"IF(BF39=\"\",\"\",(IF(BF39=\"N\",\"\",(IF(T39=\"Y\",\"Y\",(IF(AA39=\"\",\"Y\",(IF(AA39=0,\"\",(IF(BF39=\"Y\",(AB39+AC39+AE39+AF39+AH39+AI39))))))))))))","v":""},{"$f":"IF(BG39=\"\",\"\",(IF(BG39=\"N\",\"\",(IF(BF39=\"Y\",\"\",(IF(Q39=\"Y\",\"\",(IF(BG39=\"Y\",(AW39+AY39+AZ39+BB39))))))))))","v":""},{"$f":"(IF(BF39=\"Y\",\"\",(IF(BG39=\"Y\",\"\",(IF(AL39>0,\"\",(IF(T39=\"Y\",\"Y\",(IF(AA39=\"\",\"\",(IF(AJ39>0,BI39,(IF(AK39>0,BI39,(AM39+AN39+AR39+AS39+AU39+AV39+AP39+AQ39)))))))))))))))","v":""},{"$f":"(IF(AA39=\"\",\"\",(IF(M39=\"\",\"\",(IF(Q39=\"Y\",\"\",(IF(BG39=\"N\",\"\",(IF(BF39=\"Y\",\"\",(IF(BG39=\"Y\",(AX39+BA39)))))))))))))","v":""},{"$f":"IF(AT39=0,\"\",(IF(AQ39=\"Y\",\"\",(AT39))))","v":""},{"$f":"IF(AA39=\"\",\"\",(IF(Q39=\"Y\",\"\",(IF(AR39=0,\"\",(AR39))))))","v":""},{"$f":"IF(AO39=0,\"\",(IF(Q39=\"Y\",\"\",(AO39*2))))","v":""},{"$f":"IF(AM39=0,\"\",(IF(Q39=\"Y\",\"\",(AM39*2))))","v":""},{"$f":"(IF(AE39=0,\"\",(IF(Q39=\"Y\",\"\",(AE39*2)))))","v":""},{"$f":"IF(AD39=0,\"\",(IF(Q39=\"Y\",\"\",(AD39))))","v":""},{"$f":"IF(BN39=\"\",\"\",(IF(S39=\"Y\",\"\",(IF(R39=\"Y\",\"\",(IF(Q39=\"Y\",\"\",(IF(T39=\"Y\",\"\",(IF(BF39=\"\",\"\",(IF(BF39=\"N\",\"\",(CL39))))))))))))))","v":""},{"$f":"IF(BF39=\"\",\"\",(IF(BF39=\"N\",\"\",(IF(BP39=\"\",\"\",(IF(R39=\"Y\",\"\",(IF(T39=\"Y\",\"\",(IF($CY$4=\"\",\"\",(IF(AA39=\"\",\"\",(PI()*((BP39/2)*(BP39/2)))/10000*AA39)))))))))))))","v":""}]
[null,null,null,null,null,null,null,null,null,null,null,null,null,null,null,null,null,null,null,null,null,{"$f":"IF(BF40=\"\",\"\",(IF(U40=\"\",\"\",(IF(BF40=\"N\",\"\",(IF(BF40=\"Y\",U40)))))))","v":""},null,{"$f":"IF(V40=\"\",\"\",(IF(BF40=\"N\",\"\",((V40*W40)/10000))))","v":""},null,null,null,0,0,0,0,0,0,0,0,0,0,0,0,0,0,0,0,0,0,0,0,0,0,0,0,0,0,0,null,null,null,null,null,null,null,null,null,null,null,null,null,null,null,null,null,null,"",null,null,null,"","",null,"",null,"",null,"",null,"","","","",{"$f":"IF(CI40=\"\",\"\",((IF($CI40<20,4*$CI40/550,(IF($CI40<29.1,6*$CI40/550,(IF($CI40<40.1,8*$CI40/550,(IF($CI40<60.1,10*$CI40/550,12*$CI40/550))))))))*AA40))","v":""},{"$f":"IF(BF40=\"\",\"\",(IF(BF40=\"N\",\"\",(IF(T40=\"Y\",\"Y\",(IF(AA40=\"\",\"Y\",(IF(AA40=0,\"\",(IF(BF40=\"Y\",(AB40+AC40+AE40+AF40+AH40+AI40))))))))))))","v":""},{"$f":"IF(BG40=\"\",\"\",(IF(BG40=\"N\",\"\",(IF(BF40=\"Y\",\"\",(IF(Q40=\"Y\",\"\",(IF(BG40=\"Y\",(AW40+AY40+AZ40+BB40))))))))))","v":""},{"$f":"(IF(BF40=\"Y\",\"\",(IF(BG40=\"Y\",\"\",(IF(AL40>0,\"\",(IF(T40=\"Y\",\"Y\",(IF(AA40=\"\",\"\",(IF(AJ40>0,BI40,(IF(AK40>0,BI40,(AM40+AN40+AR40+AS40+AU40+AV40+AP40+AQ40)))))))))))))))","v":""},{"$f":"(IF(AA40=\"\",\"\",(IF(M40=\"\",\"\",(IF(Q40=\"Y\",\"\",(IF(BG40=\"N\",\"\",(IF(BF40=\"Y\",\"\",(IF(BG40=\"Y\",(AX40+BA40)))))))))))))","v":""},"",{"$f":"IF(AA40=\"\",\"\",(IF(Q40=\"Y\",\"\",(IF(AR40=0,\"\",(AR40))))))","v":""},{"$f":"IF(AO40=0,\"\",(IF(Q40=\"Y\",\"\",(AO40*2))))","v":""},{"$f":"IF(AM40=0,\"\",(IF(Q40=\"Y\",\"\",(AM40*2))))","v":""},"","",{"$f":"IF(BN40=\"\",\"\",(IF(S40=\"Y\",\"\",(IF(R40=\"Y\",\"\",(IF(Q40=\"Y\",\"\",(IF(T40=\"Y\",\"\",(IF(BF40=\"\",\"\",(IF(BF40=\"N\",\"\",(CL40))))))))))))))","v":""},{"$f":"IF(BF40=\"\",\"\",(IF(BF40=\"N\",\"\",(IF(BP40=\"\",\"\",(IF(R40=\"Y\",\"\",(IF(T40=\"Y\",\"\",(IF($CY$4=\"\",\"\",(IF(AA40=\"\",\"\",(PI()*((BP40/2)*(BP40/2)))/10000*AA40)))))))))))))","v":""}]
[null,null,null,"wwwww"]

{"sheet":"BlankSummary","index":12,"n_rows":67,"n_cols":10,"rows_kept":67,"cut":false,"hidden":true,"merged":[[57,6,57,9],[56,0,56,9],[57,0,57,5],[49,6,49,7],[50,0,50,3],[50,4,50,5],[50,6,50,7],[46,0,46,7],[46,8,47,9],[54,1,54,9],[66,0,66,3],[66,8,66,9],[60,0,60,3],[60,4,60,7],[60,8,60,9],[61,0,61,3],[61,4,62,7],[62,0,62,3],[61,8,61,9],[62,8,62,9],[63,0,63,3],[64,0,64,3],[65,0,65,3],[65,8,65,9],[63,8,63,9],[64,8,64,9],[58,1,58,9],[52,0,53,4],[52,5,52,6],[53,5,53,6],[52,8,53,9],[40,0,40,3],[40,4,40,5],[40,6,40,7],[40,8,43,9],[41,0,41,3],[47,0,47,3],[47,4,47,5],[47,6,47,7],[48,0,48,3],[48,4,48,5],[48,6,48,7],[48,8,51,9],[49,4,49,5],[41,4,41,5],[41,6,41,7],[42,0,42,3],[42,4,42,5],[42,6,42,7],[44,0,45,4],[44,5,44,6],[45,5,45,6],[44,8,45,9],[51,0,51,5],[51,6,51,7],[35,0,35,3],[35,8,37,9],[36,0,36,3],[37,0,37,3],[38,0,38,7],[38,8,39,9],[39,0,39,3],[39,4,39,5],[39,6,39,7],[35,5,35,6],[36,5,36,6],[37,5,37,6],[43,0,43,5],[43,6,43,7],[32,0,32,9],[33,0,33,7],[33,8,34,9],[34,0,34,3],[26,0,26,1],[26,4,26,5],[26,8,29,9],[27,0,27,1],[27,4,27,5],[28,0,28,1],[29,0,29,1],[28,2,28,7],[29,2,29,7],[30,1,30,9],[34,5,34,6],[25,0,25,1],[25,4,25,5],[19,0,20,2],[19,3,19,4],[19,5,19,7],[19,8,19,9],[20,3,20,4],[20,5,20,7],[20,8,20,9],[21,1,21,9],[23,0,23,9],[24,0,24,3],[24,4,24,7],[24,8,25,9],[0,0,0,6],[0,7,1,9],[1,0,1,6],[2,7,2,9],[3,7,3,9],[6,1,6,9],[2,3,2,4],[13,0,13,1],[13,8,14,8],[13,9,14,9],[14,0,14,2],[10,0,10,1],[10,4,10,5],[11,0,11,1],[11,4,11,5],[11,8,12,8],[11,9,12,9],[12,0,12,1],[12,4,12,5],[13,4,14,5],[13,6,14,6],[13,7,14,7],[4,0,4,9],[5,0,5,8],[8,0,8,9],[9,0,9,3],[9,4,9,7],[9,8,9,9],[17,0,18,2],[17,3,17,4],[17,5,17,7],[17,8,17,9],[18,3,18,4],[18,5,18,7],[18,8,18,9],[15,2,15,3],[15,6,15,7],[15,8,16,8],[15,9,16,9],[16,0,16,1],[16,2,16,3],[16,4,16,5],[16,6,16,7]]}
["DEPARTMENT OF PLANNING TRANSPORT & INFRASTRUCTURE",null,null,null,null,null,null,{"$f":"Main!F2","v":"Project Name: "}]
[{"$f":"Main!A3","v":"SAFETY & SERVICE DIVISION            Revision - August 2018"}]
["SUMMARY\n",null,null,{"$f":"Main!E4","v":"VS 2017/???"},null,null,null,{"$f":"Main!F3","v":"Road Number : "}]
["GENERAL, REMOVALS,  APPROVALS AND SET ASIDES",null,null,null,null,null,null,{"$f":"Main!F4","v":"Location :"}]
["Commonwealth Environment Protection & Biodiversity Conservation Act (EPBC Act) "]
["Will the works significantly impact a declared Ramsar Wetland or any other threatened environment; and/or species (flora & fauna) which are covered by the EPBC Act?"]
["COMMENTS"]
[]
["NATIVE VEGETATION (Covered by the Native Vegetation Act)"]
["CLEARANCE",null,null,null,"CLEARANCE UNDER REGULATION 5(1)(lb)",null,null,null,"CLEARANCE OF:\nStructurally Unsound Vegetation\nAND/OR\nVeg. Within the Clearance Envelope"]
["IMPACT",null,"Number/\nHa","SEB\nHa","IMPACT",null,"Number/\nHa","OFFSET\nHa/No.","IMPACT","Number/\nHa"]
["REMOVAL (number)",null,{"$f":"BlankImpact!AA17","v":0},{"$f":"BlankImpact!CW29","v":0},"REMOVAL (number)",null,{"$f":"BlankImpact!AF17","v":0},{"$f":"(IF(G12=\"\",\"\",G12*2))","v":0},"Number to be Removed",{"$f":"BlankImpact!AH17","v":0}]
["MAJOR PRUNE (number)",null,{"$f":"BlankImpact!AA18","v":0},{"$f":"BlankImpact!CW17","v":0},"MAJOR PRUNE (number)",null,{"$f":"BlankImpact!AF18","v":0},"N/A",null,{"$f":"BlankImpact!AH18","v":0}]
["Area to be Removed (ha)",null,{"$f":"BlankImpact!AA19","v":0},{"$f":"BlankImpact!CW7","v":0},"Area to be Removed (ha)",null,{"$f":"BlankImpact!AF19","v":0},{"$f":"(IF(G14=\"\",\"\",G14*2))","v":0},"Number to be Major Pruned",{"$f":"BlankImpact!AH18","v":0}]
["TOTAL SEB",null,null,{"$f":"SUM(D12:D14)","v":0},null,null,null,null,null,{"$f":"BlankImpact!AH20","v":0}]
["IMPACT LEVEL",3,null,null,"IMPACT LEVEL",null,null,null,"APPROVING AUTHORITY","SEMO"]
["APPROVING AUTHORITY",null,"Manager, Technical Services & NVMU",null,"APPROVING AUTHORITY",null,"Manager, Technical Services & NVMU"]
["PAYMENT INTO NVC FUND OPTION\nA Minimum Payment of $500 is Required",null,null,"PAYMENT AMOUNT FOR SCATTERED TREES",null,"PAYMENT AMOUNT FOR AREA",null,null,"TOTAL PAYMENT INTO THE  NVC FUND"]
[null,null,null,{"$f":"BlankImpact!$DB$12","v":0},null,{"$f":"BlankImpact!$DE$12","v":0},null,null,{"$f":"IF(SUM(D19,F19)=0,0,(IF(AND(D19+F19>0,D19+F19<500),500,(D19+F19))))","v":0}]
["PAYMENT INTO AMENITY PLANTING FUND OPTION  (Applies to clearance under Regulation 5(1)(lb) only)",null,null,"PAYMENT AMOUNT FOR SCATTERED TREES",null,"PAYMENT AMOUNT FOR AREA",null,null,"TOTAL PAYMENT INTO THE AMENITY PLANTING FUND"]
[null,null,null,{"$f":"H12*89.5","v":0},null,{"$f":"H14*5000","v":0},null,null,{"$f":"SUM(D21,F21)","v":0}]
["COMMENTS"]
[]
["REGULATED OR REGULATED SIGNIFICANT TREES (Covered by the Development Act)\nExcluding those trees also covered by the Native Vegetation Act"]
["REGULATED TREES",null,null,null,"REGULATED SIGNIFICANT TREES",null,null,null,"APPROVING AUTHORITY"]
["IMPACT",null,"Number","OFFSET","IMPACT",null,"Number","OFFSET"]
["REMOVAL",null,{"$f":"BlankImpact!BB17","v":0},{"$f":"C27*2","v":0},"REMOVAL",null,{"$f":"BlankImpact!BB19","v":0},{"$f":"G27*3","v":0},"Manager, Technical Services & DAC"]
["MAJOR PRUNE",null,{"$f":"BlankImpact!BB18","v":0},"N/A","MAJOR PRUNE",null,{"$f":"BlankImpact!BB20","v":0},"N/A"]
["TOTAL DAC OFFSET\n(Number)",null,"PAYMENT INTO PLANNING & DEVELOPMENT FUND OPTION"]
[{"$f":"D27+H27","v":0},null,{"$f":"(A30)*89.5","v":0}]
["COMMENTS"]
[]
["OTHER VEGETATION"]
["Declared/Environmental Weeds plus any Self-seeded Plant\n(Excluding plants as defined under the \"Notes\" for this section in Vegetation Removal Policy)",null,null,null,null,null,null,null,"APPROVING AUTHORITY"]
["IMPACT",null,null,null,"Number/Ha\n(Approval required)","Number\n(undersize-no approval)",null,"OFFSET"]
["Number of trees/shrubs to be Removed",null,null,null,{"$f":"(BlankImpact!AA20)","v":0},{"$f":"(BlankImpact!AB20)","v":0},null,"N/A","SEMO or Environment Officer"]
["Number of trees/shrubs to be Major Pruned",null,null,null,{"$f":"(BlankImpact!AA21)","v":0},{"$f":"(BlankImpact!AB21)","v":0},null,"N/A"]
["Area  to be Removed (ha)",null,null,null,{"$f":"(BlankImpact!AA22/10000)","v":0},"N/A",null,"N/A"]
["Amenity Planting or has Amenity Value",null,null,null,null,null,null,null,"APPROVING AUTHORITY"]
["IMPACT",null,null,null,"Number/Ha",null,"OFFSET\n(1:1)"]
["Number of trees/shrubs to be Removed",null,null,null,{"$f":"(BlankImpact!AA23)","v":0},null,{"$f":"E41","v":0},null,"SEMO or Manager, Technical Services"]
["Number of trees/shrubs to be Major Pruned",null,null,null,{"$f":"(BlankImpact!AA24)","v":0},null,"N/A"]
["Area of to be Removed (ha)",null,null,null,{"$f":"(BlankImpact!AA25/10000)","v":0},null,{"$f":"E43","v":0}]
["PAYMENT INTO AMENITY PLANTING FUND OPTION",null,null,null,null,null,{"$f":"(G41*89.5)+(G43*5000)","v":0}]
["CLEARANCE OF AMENITY VEGETATION WHICH IS: Structurally Unsound; Dead; and/or Within the Clearance Envelope (No offset is required)",null,null,null,null,"Removals - No.",null,{"$f":"(BlankImpact!AH23)","v":0},"SEMO"]
[null,null,null,null,null,"Major Prune - No.",null,{"$f":"(BlankImpact!AH24)","v":0}]
["Native Vegetation Not Covered by the NVA",null,null,null,null,null,null,null,"APPROVING AUTHORITY"]
["IMPACT",null,null,null,"Number/Ha",null,"OFFSET\n(2:1)"]
["Number of trees/shrubs to be Removed",null,null,null,{"$f":"(BlankImpact!AA26)","v":0},null,{"$f":"E49*2","v":0},null,"SEMO or Manager, Technical Services "]
["Number of trees/shrubs to be Major Pruned",null,null,null,{"$f":"(BlankImpact!AA27)","v":0},null,"N/A"]
["Area to be Removed (ha)",null,null,null,{"$f":"(BlankImpact!AA28/10000)","v":0},null,{"$f":"E51*2","v":0}]
["PAYMENT INTO AMENITY PLANTING FUND OPTION",null,null,null,null,null,{"$f":"(G49*89.5)+(G51*5000)","v":0}]
["CLEARANCE OF NATIVE VEGETATION NOT COVERED BY THE NVA WHICH IS:\nStructurally Unsound and/or Within the Clearance Envelope (No offset is required)",null,null,null,null,"Removals - No.",null,{"$f":"(BlankImpact!AH26)","v":0},"SEMO"]
[null,null,null,null,null,"Major Prune - No.",null,{"$f":"(BlankImpact!AH27)","v":0}]
["COMMENTS"]
[]
["MONITORING (To be Added to the Monitoring Program)"]
["Number of trees/shrubs recommended for ongoing Monitoring",null,null,null,null,null,{"$f":"BlankImpact!BB26","v":0}]
["COMMENTS"]
[]
["LOCAL GOVERNMENT COUNCIL AREA(S)",null,null,null,"PHYTOPHTHORA",null,null,null,"NRM BOARD"]
[{"$f":"IF(Main!F9=\"\",\"\",(Main!F9))","v":"1  -  "},null,null,null,"This site has been assessed as a (tick relevant box) :"]
[{"$f":"IF(Main!F10=\"\",\"\",(Main!F10))","v":"2  -  "}]
[{"$f":"IF(Main!F11=\"\",\"\",(Main!F11))","v":"3  -  "}]
[{"$f":"IF(Main!F12=\"\",\"\",(Main!F12))","v":"4  -  "}]
[{"$f":"IF(Main!F13=\"\",\"\",(Main!F13))","v":"5  -  "}]
[{"$f":"IF(Main!F14=\"\",\"\",(Main!F14))","v":"6  -  "}]

{"sheet":"BlankNative Veg Summary","index":13,"n_rows":19,"n_cols":28,"rows_kept":19,"cut":false,"hidden":true,"merged":[[6,16,6,19],[5,27,5,29],[6,27,7,29],[11,0,11,3],[8,4,8,7],[8,0,8,3],[9,0,9,7],[5,4,5,7],[6,4,6,7],[7,4,7,7],[5,0,5,3],[6,0,6,3],[7,0,7,3],[8,27,9,29],[11,16,11,23],[11,12,11,15],[7,20,7,23],[8,20,9,23],[10,27,11,29],[10,12,10,14],[8,12,9,15],[5,24,5,26],[0,17,1,29],[2,17,2,29],[3,17,3,29],[0,0,0,16],[1,0,1,16],[4,0,4,11],[5,8,5,11],[4,12,4,23],[5,20,5,23],[5,12,5,15],[4,24,4,29],[5,16,5,19],[2,0,3,11],[2,12,3,16],[10,4,10,11],[10,0,10,2],[10,16,10,23],[6,24,7,26],[8,24,9,26],[10,24,11,26],[6,20,6,23],[8,8,8,11],[9,8,9,11],[7,16,7,19],[8,16,9,19],[6,8,6,11],[7,8,7,11],[6,12,6,15],[7,12,7,15],[11,4,11,11],[18,0,18,2],[18,3,18,29],[13,0,14,11],[15,0,16,11],[13,24,13,29],[14,24,14,29],[15,24,15,29],[16,24,16,29],[13,18,13,23],[14,18,14,23],[15,18,15,23],[16,18,16,23],[13,12,13,17],[14,12,14,17],[15,12,15,17],[16,12,16,17]]}
["DEPARTMENT OF PLANNING TRANSPORT & INFRASTRUCTURE",null,null,null,null,null,null,null,null,null,null,null,null,null,null,null,null,{"$f":"Main!$F$2","v":"Project Name: "}]
[{"$f":"Main!A3","v":"SAFETY & SERVICE DIVISION            Revision - August 2018"},null,null,null,null,null,null,null,null,null,null,null,null,null,null,null,null,{"$f":"Main!$F$4","v":"Location :"}]
["Native Vegetation Impact Summary\nNative Vegetation Act, 1991",null,null,null,null,null,null,null,null,null,null,null,{"$f":"Main!E4","v":"VS 2017/???"},null,null,null,null,{"$f":"Main!$F$3","v":"Road Number : "}]
[null,null,null,null,null,null,null,null,null,null,null,null,null,null,null,null,null,{"$f":"Main!$F$4","v":"Location :"}]
["CLEARANCE",null,null,null,null,null,null,null,null,null,null,null,"CLEARANCE UNDER REGULATION 5(1)(lb)",null,null,null,null,null,null,null,null,null,null,null,"CLEARANCE OF:\nStructurally Unsound Vegetation AND/OR Vegetation within the Clearance Envelope.\nNo Off-set is Required"]
["IMPACT",null,null,null,"Number/Ha",null,null,null,"SEB (Ha)",null,null,null,"IMPACT",null,null,null,"Number/Ha",null,null,null,"OFFSET (Ha/Number)\n(DPTI Self Imposed Offset)",null,null,null,"IMPACT",null,null,"Number/Ha"]
["REMOVAL (number)",null,null,null,{"$f":"BlankImpact!AA17","v":0},null,null,null,{"$f":"BlankImpact!CW29","v":0},null,null,null,"REMOVAL (number)",null,null,null,{"$f":"BlankImpact!AF17","v":0},null,null,null,{"$f":"(IF(Q7=\"\",\"\",Q7*2))","v":0},null,null,null,"Number to be Removed",null,null,{"$f":"BlankImpact!AH17","v":0}]
["MAJOR PRUNE (number)",null,null,null,{"$f":"BlankImpact!AA18","v":0},null,null,null,{"$f":"BlankImpact!CW17","v":0},null,null,null,"MAJOR PRUNE (number)",null,null,null,{"$f":"BlankImpact!AF18","v":0},null,null,null,"N/A",null,null,null,null,null,null,{"$f":"BlankImpact!AZ18","v":0}]
["Area to be Removed (ha)",null,null,null,{"$f":"BlankImpact!AA19","v":0},null,null,null,{"$f":"BlankImpact!CW7","v":0},null,null,null,"Area to be Removed (ha)",null,null,null,{"$f":"BlankImpact!AF19","v":0},null,null,null,{"$f":"(IF(Q9=\"\",\"\",Q9*2))","v":0},null,null,null,"Number to be Major Pruned",null,null,{"$f":"BlankImpact!AH18","v":0}]
["TOTAL SEB",null,null,null,null,null,null,null,{"$f":"SUM(I7:L9)","v":0},null,null,null,null,null,null,null,null,null,null,null,null,null,null,null,null,null,null,{"$f":"BlankImpact!AZ20","v":0}]
["IMPACT LEVEL",null,null,{"$f":"BlankSummary!B16","v":3},{"$f":"IF(BlankSummary!C16=\"\",\"\",(BlankSummary!C16))","v":""},null,null,null,null,null,null,null,"IMPACT LEVEL",null,null,{"$f":"BlankSummary!F16","v":0},{"$f":"IF(BlankSummary!G16=\"\",\"\",(BlankSummary!G16))","v":""},null,null,null,null,null,null,null,"APPROVING AUTHORITY",null,null,"DPTI - Senior Environmental Management Officer"]
["APPROVING AUTHORITY",null,null,null,{"$f":"IF(BlankSummary!C17=\"\",\"\",(BlankSummary!C17))","v":"Manager, Technical Services & NVMU"},null,null,null,null,null,null,null,"APPROVING AUTHORITY",null,null,null,{"$f":"IF(BlankSummary!G17=\"\",\"\",(BlankSummary!G17))","v":"Manager, Technical Services & NVMU"}]
[]
["PAYMENT INTO NVC FUND OPTION",null,null,null,null,null,null,null,null,null,null,null,"PAYMENT AMOUNT FOR SCATTERED TREES",null,null,null,null,null,"PAYMENT AMOUNT FOR AREA",null,null,null,null,null,"TOTAL PAYMENT INTO THE  NVC FUND"]
[null,null,null,null,null,null,null,null,null,null,null,null,{"$f":"BlankImpact!$DB$12","v":0},null,null,null,null,null,{"$f":"BlankImpact!$DE$12","v":0},null,null,null,null,null,{"$f":"SUM(M15:X15)","v":0}]
["PAYMENT INTO AMENITY PLANTING FUND OPTION\n(Applies to clearance under Regulation 5(1)(lb) only & is a DPTI self imposed Off-set)",null,null,null,null,null,null,null,null,null,null,null,"PAYMENT AMOUNT FOR SCATTERED TREES",null,null,null,null,null,"PAYMENT AMOUNT FOR AREA",null,null,null,null,null,"TOTAL PAYMENT INTO DTPI AMENITY PLANTING FUND"]
[null,null,null,null,null,null,null,null,null,null,null,null,{"$f":"U7*89.5","v":0},null,null,null,null,null,{"$f":"U9*5000","v":0},null,null,null,null,null,{"$f":"SUM(M17:X17)","v":0}]
[]
["COMMENTS"]

{"sheet":"Macro","index":14,"n_rows":2,"n_cols":102,"rows_kept":2,"cut":false,"hidden":true,"merged":[[0,101,0,102],[1,101,1,102]]}
[null,null,null,null,null,null,null,null,null,null,null,null,null,null,null,null,null,null,null,null,null,{"$f":"IF(BF1=\"\",\"\",(IF(U1=\"\",\"\",(IF(BF1=\"N\",\"\",(IF(BF1=\"Y\",U1)))))))","v":""},null,{"$f":"IF(V1=\"\",\"\",(IF(BF1=\"N\",\"\",((V1*W1)/10000))))","v":""},null,null,null,{"$f":"IF(M1=\"\",0,(IF(T1=\"\",0,(IF(T1=\"Y\",0,(IF(S1=\"Y\",0, (IF(R1=\"Y\",0,(IF(BF1=\"N\",0,(IF(M1=\"P\",AA1)))))))))))))","v":0},{"$f":"IF(N1=\"\",0,(IF(T1=\"\",0,(IF(T1=\"Y\",0,(IF(S1=\"Y\",0, (IF(R1=\"Y\",0,(IF(BF1=\"N\",0,(IF(N1=\"P\",AA1)))))))))))))","v":0},{"$f":"IF(M1=\"\",0,(IF(T1=\"\",0,(IF(T1=\"N\",0,(IF(S1=\"Y\",0,(IF(BF1=\"N\",0,(IF(T1=\"Y\",(X1))))))))))))","v":0},{"$f":"IF(M1=\"\",0,(IF(T1=\"\",0,(IF(T1=\"Y\",0,(IF(S1=\"N\",0,(IF(BF1=\"N\",0,(IF(M1=\"P\",AA1)))))))))))","v":0},{"$f":"IF(N1=\"\",0,(IF(T1=\"\",0,(IF(T1=\"Y\",0,(IF(S1=\"N\",0, (IF(BF1=\"N\",0,(IF(N1=\"P\",AA1)))))))))))","v":0},{"$f":"IF(M1=\"\",0,(IF(T1=\"\",0,(IF(S1=\"N\",0,(IF(BF1=\"N\",0,(IF(T1=\"N\",0,(IF(T1=\"Y\",U1)))))))))))","v":0},{"$f":"IF(M1=\"\",0,(IF(T1=\"\",0,(IF(T1=\"Y\",0,(IF(S1=\"Y\",0,(IF(R1=\"N\",0,(IF(BF1=\"N\",0,(IF(M1=\"P\",AA1)))))))))))))","v":0},{"$f":"IF(N1=\"\",0,(IF(T1=\"\",0,(IF(T1=\"Y\",0,(IF(R1=\"N\",0, (IF(BF1=\"N\",0,(IF(N1=\"P\",AA1)))))))))))","v":0},{"$f":"IF(M1=\"\",0,(IF(BC1=\"N\",0,(IF(BD1=\"Y\",0,(IF(T1=\"Y\",0,(IF(BC1=\"E\",AA1,(IF(BC1=\"D\",AA1,(IF(BC1=\"O\",AA1,(IF(BC1=\"M\",AA1)))))))))))))))","v":0},{"$f":"IF(N1=\"\",0,(IF(BH1>0,0,(IF(BC1=\"N\",0,(IF(BD1=\"Y\",0,(IF(T1=\"Y\",0,(IF(BC1=\"E\",AA1,(IF(BC1=\"D\",AA1,(IF(BC1=\"O\",AA1,(IF(BC1=\"M\",AA1)))))))))))))))))","v":0},{"$f":"IF(M1=\"\",0,(IF(U1=\"\",0,(IF(BC1=\"N\",0,(IF(BD1=\"Y\",0,IF(T1=\"N\",0,(IF(BC1=\"E\",U1,(IF(BC1=\"D\",U1,(IF(BC1=\"O\",U1,(IF(BC1=\"M\",U1))))))))))))))))","v":0},{"$f":"(IF(M1=\"\",0,(IF(BE1=\"N\",0,(IF(BF1=\"Y\",0,(IF(BI1=0,0,(IF(BI1=\"\",\"\",(IF(Q1=\"Y\",0,(IF(R1=\"Y\",0,(IF(T1=\"Y\",0,(IF(BE1=\"Y\",AA1))))))))))))))))))","v":0},{"$f":"IF(N1=\"\",0,(IF(BE1=\"N\",0,(IF(BF1=\"Y\",0,(IF(BI1=0,0,(IF(BI1=\"\",0,(IF(Q1=\"Y\",0,(IF(R1=\"Y\",0,(IF(T1=\"Y\",0,(IF(BE1=\"Y\",AA1)))))))))))))))))","v":0},{"$f":"IF(M1=\"\",0,(IF(U1=\"\",0,(IF(T1=\"N\",0,(IF(BE1=\"N\",0,(IF(BF1=\"Y\",0,(IF(BE1=\"Y\",U1)))))))))))","v":0},{"$f":"(IF(M1=\"\",0,(IF(T1=\"Y\",0,(IF(S1=\"Y\",0,(IF(BD1=\"Y\",0,(IF(BE1=\"N\",0,(IF(BF1=\"Y\",0,(IF(BI1=0,0,(IF(BI1=\"\",\"\",(IF(R1=\"N\",0,(IF(R1=\"Y\",AA1))))))))))))))))))))+(IF(M1=\"\",0,(IF(R1=\"Y\",0,(IF(T1=\"Y\",0,(IF(S1=\"Y\",0,(IF(BD1=\"Y\",0,(IF(BE1=\"N\",0,(IF(BF1=\"Y\",0,(IF(BI1=0,0,(IF(BI1=\"\",\"\",(IF(Q1=\"Y\",AA1))))))))))))))))))))","v":0},{"$f":"(IF(N1=\"\",0,(IF(T1=\"\",0,(IF(T1=\"Y\",0,(IF(R1=\"N\",0, (IF(BF1=\"Y\",0,(IF(BE1=\"N\",0,(IF(BI1=0,0,(IF(BI1=\"\",\"\",(IF(R1=\"Y\",AA1))))))))))))))))))+(IF(N1=\"\",0,(IF(T1=\"\",0,(IF(T1=\"Y\",0,(IF(R1=\"Y\",0, (IF(BF1=\"Y\",0,(IF(BE1=\"N\",0,(IF(BI1=0,0,(IF(BI1=\"\",\"\",(IF(Q1=\"Y\",AA1))))))))))))))))))","v":0},{"$f":"(IF(M1=\"\",0,(IF(T1=\"Y\",0,(IF(BG1=\"Y\",0,(IF(BD1=\"N\",0,(IF(Q1=\"Y\",0,(IF(R1=\"Y\",0,(IF(BD1=\"Y\",AA1))))))))))))))","v":0},{"$f":"IF(N1=\"\",0,(IF(BD1=\"\",0,(IF(BD1=\"N\",0,(IF(BH1>0,0,(IF(T1=\"Y\",0,(IF(R1=\"Y\",0,(IF(Q1=\"Y\",0,(IF(BD1=\"Y\",AA1)))))))))))))))","v":0},{"$f":"IF(M1=\"\",0,(IF(BD1=\"\",0,(IF(BD1=\"N\",0,(IF(T1=\"N\",0,(IF(Q1=\"Y\",0,(IF(BD1=\"Y\",U1)))))))))))","v":0},{"$f":"(IF(M1=\"\",0,(IF(T1=\"\",0,(IF(T1=\"Y\",0,(IF(S1=\"Y\",0,(IF(R1=\"N\",0,(IF(BD1=\"N\",0,(IF(BE1=\"Y\",0,(IF(R1=\"Y\",AA1))))))))))))))))+(IF(R1=\"Y\",0,(IF(M1=\"\",0,(IF(BD1=\"N\",0,(IF(T1=\"\",0,(IF(T1=\"Y\",0,(IF(S1=\"Y\",0,(IF(BE1=\"Y\",0,(IF(Q1=\"Y\",AA1))))))))))))))))","v":0},{"$f":"(IF(N1=\"\",0,(IF(T1=\"\",0,(IF(T1=\"Y\",0,(IF(R1=\"N\",0,(IF(S1=\"Y\",0,(IF(BE1=\"Y\",0,(IF(BD1=\"N\",0,(IF(R1=\"Y\",AA1))))))))))))))))+(IF(R1=\"Y\",0,(IF(N1=\"\",0,(IF(T1=\"\",0,(IF(T1=\"Y\",0,(IF(S1=\"Y\",0,(IF(BE1=\"Y\",0,(IF(BD1=\"N\",0,(IF(Q1=\"Y\",AA1))))))))))))))))","v":0},{"$f":"IF(M1=\"\",0,(IF(BF1=\"Y\",0,(IF(BH1=\"\",0,(IF(BG1=\"N\",0,(IF(BH1=\"R\",0,(IF(BH1=\"S\",AA1)))))))))))","v":0},{"$f":"(IF(AW1=0,0,AW1))*3","v":0},{"$f":"IF(N1=\"\",0,(IF(BF1=\"Y\",0,(IF(BG1=\"N\",0,(IF(BH1=\"R\",0,(IF(BH1=\"S\",AA1)))))))))","v":0},{"$f":"IF(M1=\"\",0,(IF(BF1=\"Y\",0,(IF(BG1=\"N\",0,(IF(BH1=\"\",0,(IF(BH1=\"S\",0,(IF(BH1=\"R\",AA1)))))))))))","v":0},{"$f":"(IF(AZ1=0,0,AZ1))*2","v":0},{"$f":"IF(N1=\"\",0,(IF(BF1=\"Y\",0,(IF(BG1=\"N\",0,(IF(BH1=\"S\",0,(IF(BH1=\"R\",AA1)))))))))","v":0},null,null,null,null,null,null,null,null,null,null,null,null,null,null,null,null,{"$f":"IF(BK1=\"\",\"\",(BK1*12))","v":""},null,{"$f":"(IF(BT1=\"\",\"\",((BT1*50)^0.42)*0.64))","v":""},null,null,null,{"$f":"IF(BF1=\"\",\"\",(IF(BF1=\"N\",\"\",(IF(BF1=\"Y\",(IF(BN1=\"\",\"\",(IF($BN1<10,1,(IF($BN1<20,2,3))))*1.05)))))))","v":""},{"$f":"IF(BV1=\"\",\"\",(IF(BF1=\"N\",\"\",(IF(BF1=\"Y\",((100-$BV1)*0.04)+2)))))","v":""},null,{"$f":"IF(CA1=\"\",\"\",(IF(BF1=\"N\",\"\",(IF(BF1=\"Y\",(CA1*1.45))))))","v":""},null,{"$f":"IF(CC1=\"\",\"\",(IF(BF1=\"N\",\"\",(IF(BF1=\"Y\",(CC1*0.65))))))","v":""},null,{"$f":"IF(CE1=\"\",\"\",(IF(BF1=\"N\",\"\",(IF(BF1=\"Y\",(CE1*0.4))))))","v":""},null,{"$f":"IF(CG1=\"\",\"\",(IF(BF1=\"N\",\"\",(IF(BF1=\"Y\",(CG1*0.35))))))","v":""},{"$f":"IF(BY1=\"\",\"\",(SUM(BY1,BZ1,CB1,CD1,CF1,CH1)*SUM(BY1,BZ1,CB1,CD1,CF1,CH1)*SUM(BY1,BZ1,CB1,CD1,CF1,CH1)/55.5))","v":""},{"$f":"IF(CI1=\"\",\"\",IF(CI1<30,0,(IF(CI1>=30,1))))","v":""},{"$f":"IF(CI1=\"\",\"\",(IF(CJ1=1,CJ1=\"@\",(IF(CJ1=0,(IF($CI1<20,4*$CI1/550,(IF($CI1<30,6*$CI1/550,(IF($CI1<41,8*$CI1/550,(IF($CI1<61,10*$CI1/550,12*$CI1/550)))))))))))))","v":""},{"$f":"IF(CI1=\"\",\"\",((IF($CI1<20,4*$CI1/550,(IF($CI1<29.1,6*$CI1/550,(IF($CI1<40.1,8*$CI1/550,(IF($CI1<60.1,10*$CI1/550,12*$CI1/550))))))))*AA1))","v":""},{"$f":"IF(BF1=\"\",\"\",(IF(BF1=\"N\",\"\",(IF(T1=\"Y\",\"Y\",(IF(AA1=\"\",\"Y\",(IF(AA1=0,\"\",(IF(BF1=\"Y\",(AB1+AC1+AE1+AF1+AH1+AI1))))))))))))","v":""},{"$f":"IF(BG1=\"\",\"\",(IF(BG1=\"N\",\"\",(IF(BF1=\"Y\",\"\",(IF(Q1=\"Y\",\"\",(IF(BG1=\"Y\",(AW1+AY1+AZ1+BB1))))))))))","v":""},{"$f":"(IF(BF1=\"Y\",\"\",(IF(BG1=\"Y\",\"\",(IF(AL1>0,\"\",(IF(T1=\"Y\",\"Y\",(IF(AA1=\"\",\"\",(IF(AJ1>0,BI1,(IF(AK1>0,BI1,(AM1+AN1+AR1+AS1+AU1+AV1+AP1+AQ1)))))))))))))))","v":""},{"$f":"(IF(AA1=\"\",\"\",(IF(M1=\"\",\"\",(IF(Q1=\"Y\",\"\",(IF(BG1=\"N\",\"\",(IF(BF1=\"Y\",\"\",(IF(BG1=\"Y\",(AX1+BA1)))))))))))))","v":""},{"$f":"IF(AT1=0,\"\",(IF(AQ1=\"Y\",\"\",(AT1))))","v":""},{"$f":"IF(AA1=\"\",\"\",(IF(Q1=\"Y\",\"\",(IF(AR1=0,\"\",(AR1))))))","v":""},{"$f":"IF(AO1=0,\"\",(IF(Q1=\"Y\",\"\",(AO1*2))))","v":""},{"$f":"IF(AM1=0,\"\",(IF(Q1=\"Y\",\"\",(AM1*2))))","v":""},{"$f":"(IF(AE1=0,\"\",(IF(Q1=\"Y\",\"\",(AE1*2)))))","v":""},{"$f":"IF(AD1=0,\"\",(IF(Q1=\"Y\",\"\",(AD1))))","v":""},{"$f":"IF(BN1=\"\",\"\",(IF(S1=\"Y\",\"\",(IF(R1=\"Y\",\"\",(IF(Q1=\"Y\",\"\",(IF(T1=\"Y\",\"\",(IF(BF1=\"\",\"\",(IF(BF1=\"N\",\"\",(CL1))))))))))))))","v":""},{"$f":"IF(BF1=\"\",\"\",(IF(BF1=\"N\",\"\",(IF(BP1=\"\",\"\",(IF(R1=\"Y\",\"\",(IF(T1=\"Y\",\"\",(IF($CY$6=\"\",\"\",(IF(AA1=\"\",\"\",(PI()*((BP1/2)*(BP1/2)))/10000*AA1)))))))))))))","v":""}]
["xxxx",null,null,null,null,null,null,null,null,null,null,null,null,null,null,null,null,null,null,null,null,{"$f":"IF(BF2=\"\",\"\",(IF(U2=\"\",\"\",(IF(BF2=\"N\",\"\",(IF(BF2=\"Y\",U2)))))))","v":""},null,{"$f":"IF(V2=\"\",\"\",(IF(BF2=\"N\",\"\",((V2*W2)/10000))))","v":""},null,null,null,0,0,0,0,0,0,0,0,0,0,0,0,0,0,0,0,0,0,0,0,0,0,0,0,0,0,0,null,null,null,null,null,null,null,null,null,null,null,null,null,null,null,null,"",null,{"$f":"(IF(BT2=\"\",\"\",((BT2*50)^0.42)*0.64))","v":""},null,null,null,{"$f":"IF(BF2=\"\",\"\",(IF(BF2=\"N\",\"\",(IF(BF2=\"Y\",(IF(BN2=\"\",\"\",(IF($BN2<10,1,(IF($BN2<20,2,3))))*1.05)))))))","v":""},{"$f":"IF(BV2=\"\",\"\",(IF(BF2=\"N\",\"\",(IF(BF2=\"Y\",((100-$BV2)*0.04)+2)))))","v":""},null,{"$f":"IF(CA2=\"\",\"\",(IF(BF2=\"N\",\"\",(IF(BF2=\"Y\",(CA2*1.45))))))","v":""},null,{"$f":"IF(CC2=\"\",\"\",(IF(BF2=\"N\",\"\",(IF(BF2=\"Y\",(CC2*0.65))))))","v":""},null,{"$f":"IF(CE2=\"\",\"\",(IF(BF2=\"N\",\"\",(IF(BF2=\"Y\",(CE2*0.4))))))","v":""},null,{"$f":"IF(CG2=\"\",\"\",(IF(BF2=\"N\",\"\",(IF(BF2=\"Y\",(CG2*0.35))))))","v":""},{"$f":"IF(BY2=\"\",\"\",(SUM(BY2,BZ2,CB2,CD2,CF2,CH2)*SUM(BY2,BZ2,CB2,CD2,CF2,CH2)*SUM(BY2,BZ2,CB2,CD2,CF2,CH2)/55.5))","v":""},{"$f":"IF(CI2=\"\",\"\",IF(CI2<30,0,(IF(CI2>=30,1))))","v":""},{"$f":"IF(CI2=\"\",\"\",(IF(CJ2=1,CJ2=\"@\",(IF(CJ2=0,(IF($CI2<20,4*$CI2/550,(IF($CI2<30,6*$CI2/550,(IF($CI2<41,8*$CI2/550,(IF($CI2<61,10*$CI2/550,12*$CI2/550)))))))))))))","v":""},{"$f":"IF(CI2=\"\",\"\",((IF($CI2<20,4*$CI2/550,(IF($CI2<29.1,6*$CI2/550,(IF($CI2<40.1,8*$CI2/550,(IF($CI2<60.1,10*$CI2/550,12*$CI2/550))))))))*AA2))","v":""},{"$f":"IF(BF2=\"\",\"\",(IF(BF2=\"N\",\"\",(IF(T2=\"Y\",\"Y\",(IF(AA2=\"\",\"Y\",(IF(AA2=0,\"\",(IF(BF2=\"Y\",(AB2+AC2+AE2+AF2+AH2+AI2))))))))))))","v":""},{"$f":"IF(BG2=\"\",\"\",(IF(BG2=\"N\",\"\",(IF(BF2=\"Y\",\"\",(IF(Q2=\"Y\",\"\",(IF(BG2=\"Y\",(AW2+AY2+AZ2+BB2))))))))))","v":""},{"$f":"(IF(BF2=\"Y\",\"\",(IF(BG2=\"Y\",\"\",(IF(AL2>0,\"\",(IF(T2=\"Y\",\"Y\",(IF(AA2=\"\",\"\",(IF(AJ2>0,BI2,(IF(AK2>0,BI2,(AM2+AN2+AR2+AS2+AU2+AV2+AP2+AQ2)))))))))))))))","v":""},{"$f":"(IF(AA2=\"\",\"\",(IF(M2=\"\",\"\",(IF(Q2=\"Y\",\"\",(IF(BG2=\"N\",\"\",(IF(BF2=\"Y\",\"\",(IF(BG2=\"Y\",(AX2+BA2)))))))))))))","v":""},{"$f":"IF(AT2=0,\"\",(IF(AQ2=\"Y\",\"\",(AT2))))","v":""},{"$f":"IF(AA2=\"\",\"\",(IF(Q2=\"Y\",\"\",(IF(AR2=0,\"\",(AR2))))))","v":""},{"$f":"IF(AO2=0,\"\",(IF(Q2=\"Y\",\"\",(AO2*2))))","v":""},{"$f":"IF(AM2=0,\"\",(IF(Q2=\"Y\",\"\",(AM2*2))))","v":""},{"$f":"(IF(AE2=0,\"\",(IF(Q2=\"Y\",\"\",(AE2*2)))))","v":""},{"$f":"IF(AD2=0,\"\",(IF(Q2=\"Y\",\"\",(AD2))))","v":""},{"$f":"IF(BN2=\"\",\"\",(IF(S2=\"Y\",\"\",(IF(R2=\"Y\",\"\",(IF(Q2=\"Y\",\"\",(IF(T2=\"Y\",\"\",(IF(BF2=\"\",\"\",(IF(BF2=\"N\",\"\",(CL2))))))))))))))","v":""},{"$f":"IF(BF2=\"\",\"\",(IF(BF2=\"N\",\"\",(IF(BP2=\"\",\"\",(IF(R2=\"Y\",\"\",(IF(T2=\"Y\",\"\",(IF($CY$6=\"\",\"\",(IF(AA2=\"\",\"\",(PI()*((BP2/2)*(BP2/2)))/10000*AA2)))))))))))))","v":""}]

{"sheet":"Validation Lists","index":15,"n_rows":10,"n_cols":8,"rows_kept":10,"cut":false,"hidden":true,"merged":[]}
["CLEARANCE ENVELOPE (S - STANDARD, R - RESTRICTED)","SINGLE-STEMMED(S) OR  MULTI-STEMMED(M) SPECIMEN","WEED SPECIES & OTHERS \n[N (No); D (Declared); E (Environmental; O (Other-selfseeded; M (Mixed-A range of above)]","YES or NO","REGULATED (R) OR REGULATED SIGNIFICANT TREES (S)","SIDE OF ROAD (L - LEFT, R - RIGHT)","NRM BOARDS","TSD REGIONS"]
["ValidEnvelop","ValidStem","ValidWeed","ValidYesNo","ValidRegulate","ValidSide","ValidNRM","ValidRegion"]
["S","S","N","Y","R","L","Adelaide & Mt Lofty","Metropolitan"]
["R","M","D","N","S","R","Alinytjara Wilurara","Eastern"]
[null,"S/M","E",null,null,null,"Eyre Peninsula","N & W"]
[null,null,"O",null,null,null,"Kangaroo Island"]
[null,null,"M",null,null,null,"Northern & Yorke"]
[null,null,null,null,null,null,"SA Arid Lands"]
[null,null,null,null,null,null,"SA Murray-Darling Basin"]
[null,null,null,null,null,null,"South East"]

{"sheet":"Signatures","index":16,"n_rows":27,"n_cols":1,"rows_kept":27,"cut":false,"hidden":true,"merged":[]}
["To the Principal Environmental Advisor"]
["The above request has been endorsed."]
[]
[]
[]
["Senior Environmental Advisor"]
["     /     /"]
[]
[]
["To the Project Manager"]
["The above request has been approved."]
[]
[]
[]
["Principal Environmental Advisor"]
["     /     /"]
[]
[]
[]
[]
["To the Project Manager"]
["The above request has been approved."]
[]
[]
[]
["Senior Environmental Advisor"]
["     /     /"]

{"sheet":"Data Sheet History","index":17,"n_rows":63,"n_cols":7,"rows_kept":63,"cut":false,"hidden":true,"merged":[[62,1,67,14],[59,1,60,14],[35,3,35,4],[27,3,27,4],[28,3,28,4],[53,1,54,13],[50,1,51,13],[29,1,29,2],[29,3,29,4],[29,6,30,13],[48,1,48,14],[45,1,45,14],[38,1,38,2],[38,3,38,4],[38,6,39,13],[46,1,46,14],[47,1,47,14],[30,3,30,4],[26,1,26,2],[27,1,27,2],[28,1,28,2],[30,1,30,2],[37,1,37,2],[26,3,26,4],[24,1,24,2],[25,1,25,2],[16,6,17,13],[24,3,24,4],[25,3,25,4],[53,0,54,0],[7,1,8,13],[3,1,4,13],[15,1,15,2],[16,1,16,2],[18,1,18,2],[15,3,15,4],[16,3,16,4],[18,3,18,4],[35,1,35,2],[36,1,36,2],[36,3,36,4],[37,3,37,4],[17,1,17,2],[17,3,17,4],[22,1,22,13],[1,1,2,13],[11,1,11,13],[12,1,12,13],[13,1,13,2],[14,1,14,2],[13,3,13,4],[14,3,14,4]]}
[]
[null,"This data sheet had a major up-date in 2003 to reflect the requirements of the Native Vegetation Act 1991"]
[]
[null,"It incorporated the excel spread sheet for addressing Principle 1b, Wild life habitat (See page 7 of \"Scattered Tree Clearance Assessment in South Australia\")"]
[]
[]
[]
["2007-12-11","The formulas in the last 2 columns of the data sheet have been changed to relfect the SEB calculation requirements as described in DTEI Significant Environmental Benefit Guidelines, Version 1, Issued December 2007  "]
[]
[null,"Main points, extracted from the Guideline and influencing the changes to the data sheet are as follows:"]
[]
[null,"3.3.2        Step 2:  Calculate SEB requirement for each individual tree"]
[null,"To ensure that higher value habitat trees gain a higher value SEB, a multiplication factor is applied to each tree score"]
[null,"Tree Score",null,"SEBMF"]
[null,"< 20",null,4]
[null,"20 - 29",null,6]
[null,"30 - 40",null,8,null,null,"These numbers were used in the formulas amended to relect changes July 2008 (shown in green)"]
[null,"41 - 60",null,10]
[null,"> 60",null,12]
[null,"Table 3.2: SEB Multiplication Factor (SEBMF)"]
[]
[]
[null,"3.3.4        Step 4: Calculate offset SEB point score per hectare"]
[]
[null,"Habitat Significance Rating (HSR)",null,"Numerical HSR rating score"]
[null,"Category A",null,400]
[null,"Category B",null,375]
[null,"Category C",null,350]
[null,"Category D",null,325]
[null,"Category E",null,300,null,null,"It was agreed with Anne and Cathy that, to reduce the complexity of calculating the SEB, 300 would be used as the standard in the formulas"]
[null,"Category F",null,275]
[]
[null,"Table 3.3. Habitat Significance Rating and corresponding (stepped) numerical score."]
[]
[]
[null,"LCR",null,"Numerical LCR rating score"]
[null,"Good",null,2.5]
[null,"Moderate",null,2.25]
[null,"Low",null,2,null,null,"It was agreed with Anne and Cathy that, to reduce the complexity of calculating the SEB, 2 would be used as the standard in the formulas"]
[]
[null,"Table 3.4. Landscape Context Rating and corresponding (stepped) numerical score "]
[]
[null,"The offset SEB point score per hectare is calculated by multiplying the HSR by the LSR which in this instance is 550."]
[]
[null,"Main reasons for selecting 275 x 2 as the standard are:"]
[null,"- To reduce complexity of calculating the SEB"]
[null,"- This is the figure which would be used if paying into the fund"]
[null,"- If on-ground works are proposed, the actual set-aside area at the time of the vegetation survey is not likely to be known. The client often needs to have some indication of costs at this stage."]
[null,"- That the actual set-aside area is unlikely to be a high category site "]
[]
["2008-07-01","The formulas in the last 2 columns of the data sheet have been changed to reflect additional levels to the SEB calculation requirements and are as shown in green above."]
[]
[]
["May 2009 to Mid 2010","Major up-date of the date sheet, including the introduction of the \"Impacts Table\", \"Summary Table\" & \"Native veg Summary Table\""]
[]
[]
["2011-02-01","Formula changed in SEB column to reflect what Native Veg use internally - for details refer"]
[null,"DOCS_AND_FILES-#5268394-Environment - Vegetation Services - Guidelines - email from Native Vegetation re SEB - RE: SEB query - pink gums"]
[]
["2013-07-31","DAC tree information up-dated with other minor problems rectified. Also \"GIS dump\" spreadsheet has been added to allow for an automatic creation of \"format clean\" data sheet which is suitable for use in GIS systems."]
[]
[]
["May/June 2014","Major Data Sheet Up-date which includes:\n-  Major up dates to all existing spreadsheets to increase functionality, reduce errors and reduce the need to redo some information entry when the\n   data sheet is re-run.\n-  addition of extended Native Vegetation List \n-  new \"Native Vegetation Summary\" spreadsheet \n-  new \"Vegetation Removal Request\" spreadsheet\n-  new \"Guide\" spreadsheet\n-  additional \"hidden\" sheets have also been added to allow the above sheets to function.\nThis major data sheet up-date has been undertaken in conjuction with a major Guideline re-write"]